setup
checks.aarch64-linux.tests
· build #360
· raw
1this derivation will be built:2 /nix/store/anwa0qxbd14p2wd1p1skim75riy7m455-horae-tests-0.1.0.drv3error: build of '/nix/store/anwa0qxbd14p2wd1p1skim75riy7m455-horae-tests-0.1.0.drv' on 'grpc://farm.numtide.com:50051?client-cert=/run/secrets/vars/per-machine/bld1/nix-farm-ci/crt&client-key=/run/secrets/vars/per-machine/bld1/nix-farm-ci/key&connect-timeout=23&system=aarch64-linux' failed: Cannot build '/nix/store/anwa0qxbd14p2wd1p1skim75riy7m455-horae-tests-0.1.0.drv'.4 Reason: builder failed with exit code 101.5 Output paths:6 /nix/store/yvlhmxqgdknj4gdw3iy7k5gxq3705rya-horae-tests-0.1.07 Last 25 log lines:8 > Request ID: 01a1185b-0593-7872-b336-3885f346b1a89 > Request ID: 01a1185b-059c-78d2-9de6-0c2d15d619db10 > Request ID: 01a1185b-05d2-71a3-81f3-468821e061b711 > Request ID: 01a1185b-05d8-7a70-96ea-6effd900087512 > Request ID: 01a1185b-0608-74f1-b72c-b0ecfaba084913 > Request ID: 01a1185b-060c-76d1-b4fa-718dbc2b8e8e14 >15 > thread 'server_fns::importers::authorization_tests::job_endpoints_enforce_session_role_and_organization' (5731) panicked at crates/horae/src/server_fns/importers/authorization_tests/cli.rs:75:13:16 > assertion `left == right` failed: ["import", "harvest-csv", "/build/.tmp9hICQX/source.csv", "--dry-run"]: {"error":{"category":"indeterminate_submission","message":"Submission acknowledgement unavailable; resubmit identical input with the same request ID"},"operation":"import.harvest-csv","outcome":"error","request_id":"01a1185b-060c-76d1-b4fa-718dbc2b8e8e","version":1}17 > left: 618 > right: 119 >20 > ---- server_fns::permissions::project_management_tests::legacy_project_lock_returns_busy_instead_of_forming_an_org_fk_cycle stdout ----21 >22 > thread 'server_fns::permissions::project_management_tests::legacy_project_lock_returns_busy_instead_of_forming_an_org_fk_cycle' (7389) panicked at crates/horae/src/server_fns/permissions/tests/project_management.rs:797:5:23 > Ok(ProjectManagersOutcome { project_id: 01a1185c-5774-70e1-a687-9bb12dbbd1b8, access_revision: 1, changed: true })24 >25 >26 > failures:27 > server_fns::importers::authorization_tests::job_endpoints_enforce_session_role_and_organization28 > server_fns::permissions::project_management_tests::legacy_project_lock_returns_busy_instead_of_forming_an_org_fk_cycle29 >30 > test result: FAILED. 1125 passed; 2 failed; 11 ignored; 0 measured; 0 filtered out; finished in 304.55s31 >32 > error: test failed, to rerun pass `-p horae --bin horae`33 For full logs, run:34 nix log /nix/store/anwa0qxbd14p2wd1p1skim75riy7m455-horae-tests-0.1.0.drv35error: Cannot build '/nix/store/anwa0qxbd14p2wd1p1skim75riy7m455-horae-tests-0.1.0.drv'.36 Reason: builder failed with exit code 1.37 Output paths:38 /nix/store/yvlhmxqgdknj4gdw3iy7k5gxq3705rya-horae-tests-0.1.0