nixbot

builds

numtide/horae build #355 failed

branch integration/permission-audit-prerequisites · PR #245 · commit 322f62b0b0 · · took 2h 18m · eval 18s

1 failed
failed attributes
status attribute duration
failed checks.x86_64-linux.tests 4m 44s
horae-tests-0.1.0: thread 'server_fns::importers::authorization_tests::job_endpoints_enforce_session_role_and_organization' (4730) panicked at crates/horae/src/ …
horae-tests-0.1.0:
thread 'server_fns::importers::authorization_tests::job_endpoints_enforce_session_role_and_organization' (4730) panicked at crates/horae/src/server_fns/importers/authorization_tests/cli.rs:75:13:
assertion `left == right` failed: ["import", "harvest-csv", "/build/.tmpmekilH/source.csv", "--dry-run"]: {"error":{"category":"indeterminate_submission","message":"Submission acknowledgement unavailable; resubmit identical input with the same request ID"},"operation":"import.harvest-csv","outcome":"error","request_id":"01a11840-2484-7022-9d8b-0364ca3b2c88","version":1}
  left: 6
 right: 1
failures:
    server_fns::importers::authorization_tests::job_endpoints_enforce_session_role_and_organization
test result: FAILED. 968 passed; 1 failed; 11 ignored; 0 measured; 0 filtered out; finished in 97.39s
error: test failed, to rerun pass `-p horae --bin horae`
15 succeeded
succeeded attributes
status attribute duration
loading…
4 already built
skipped attributes
status attribute duration
loading…