horae-tests-0.1.0:
thread 'server_fns::importers::authorization_tests::job_endpoints_enforce_session_role_and_organization' (4716) panicked at crates/horae/src/ …
horae-tests-0.1.0:
thread 'server_fns::importers::authorization_tests::job_endpoints_enforce_session_role_and_organization' (4716) panicked at crates/horae/src/server_fns/importers/authorization_tests/cli.rs:75:13:
assertion `left == right` failed: ["import", "harvest-csv", "/build/.tmp9Sm2k5/source.csv", "--dry-run"]: {"error":{"category":"indeterminate_submission","message":"Submission acknowledgement unavailable; resubmit identical input with the same request ID"},"operation":"import.harvest-csv","outcome":"error","request_id":"01a11818-4ff2-7b83-b811-c47061cbeeac","version":1}
left: 6
right: 1
failures:
server_fns::importers::authorization_tests::job_endpoints_enforce_session_role_and_organization
test result: FAILED. 875 passed; 1 failed; 11 ignored; 0 measured; 0 filtered out; finished in 189.99s
error: test failed, to rerun pass `-p horae --bin horae`
|