nixbot

builds

numtide/horae build #327 failed

branch refactor/permission-domain-foundation · PR #222 · commit 1fef1a2461 · · took 1h 20m · eval 51s

1 failed
failed attributes
status attribute duration
failed checks.x86_64-linux.tests 8m 34s
horae-tests-0.1.0: thread 'server_fns::importers::authorization_tests::job_endpoints_enforce_session_role_and_organization' (4663) panicked at crates/horae/src/ …
horae-tests-0.1.0:
thread 'server_fns::importers::authorization_tests::job_endpoints_enforce_session_role_and_organization' (4663) panicked at crates/horae/src/server_fns/importers/authorization_tests/cli.rs:75:13:
assertion `left == right` failed: ["import", "harvest-csv", "/build/.tmpbxhi5c/source.csv", "--dry-run"]: {"error":{"category":"indeterminate_submission","message":"Submission acknowledgement unavailable; resubmit identical input with the same request ID"},"operation":"import.harvest-csv","outcome":"error","request_id":"01a117fb-c095-7252-b603-4e8dcd3187cb","version":1}
  left: 6
 right: 1
failures:
    server_fns::importers::authorization_tests::job_endpoints_enforce_session_role_and_organization
test result: FAILED. 829 passed; 1 failed; 11 ignored; 0 measured; 0 filtered out; finished in 84.07s
error: test failed, to rerun pass `-p horae --bin horae`
15 succeeded
succeeded attributes
status attribute duration
loading…
4 already built
skipped attributes
status attribute duration
loading…