nixbot

builds

numtide/horae build #291 failed

branch feat/scoped-harvest-projects · PR #281 · commit 1c254582be · · took 7m 41s · eval 17s

6 failed
failed attributes
status attribute duration
failed checks.aarch64-linux.clippy 3m 4s
horae-clippy-0.1.0: error: `SQLX_OFFLINE=true` but there is no cached data for this query, run `cargo sqlx prepare` to update the query cache or unset `SQLX_OFF …
horae-clippy-0.1.0:
error: `SQLX_OFFLINE=true` but there is no cached data for this query, run `cargo sqlx prepare` to update the query cache or unset `SQLX_OFFLINE`
  --> crates/horae/src/harvest/pagination_tests/client_permissions.rs:55:5
   |
55 |     sqlx::query!("UPDATE clients SET active=false WHERE id=$1", ids.client_id)
   |     ^^^^^^^^^^^^^^^^^^^^^^^^^^^^^^^^^^^^^^^^^^^^^^^^^^^^^^^^^^^^^^^^^^^^^^^^^^
   |
   = note: this error originates in the macro `$crate::sqlx_macros::expand_query` which comes from the expansion of the macro `sqlx::query` (in Nightly builds, run with -Z macro-backtrace for more info)
error: could not compile `horae` (bin "horae" test) due to 1 previous error
failed checks.aarch64-linux.sqlx-prepare 2m 46s
horae-sqlx-prepare-0.1.0: Applied 43/migrate permission change receipts (3.717416ms) Applied 44/migrate permission management assignments (4.75506ms) Applied 47 …
horae-sqlx-prepare-0.1.0:
Applied 43/migrate permission change receipts (3.717416ms)
Applied 44/migrate permission management assignments (4.75506ms)
Applied 47/migrate permission template name collation (1.970968ms)
+++ command cargo sqlx prepare --workspace --check -- --features server --all-targets
   Compiling horae v0.1.0 (/build/source/crates/horae)
    Checking horae-core v0.1.0 (/build/source/crates/core)
    Finished `dev` profile [unoptimized + debuginfo] target(s) in 2m 19s
error: prepare check failed: .sqlx is missing one or more queries; you should re-run sqlx prepare
failed checks.aarch64-linux.tests 3m 21s
horae-tests-0.1.0: --> crates/horae/src/harvest/pagination_tests/client_permissions.rs:55:5 | 55 | sqlx::query!("UPDATE clients SET active=false WHERE …
horae-tests-0.1.0:
  --> crates/horae/src/harvest/pagination_tests/client_permissions.rs:55:5
   |
55 |     sqlx::query!("UPDATE clients SET active=false WHERE id=$1", ids.client_id)
   |     ^^^^^^^^^^^^^^^^^^^^^^^^^^^^^^^^^^^^^^^^^^^^^^^^^^^^^^^^^^^^^^^^^^^^^^^^^^
   |
   = note: this error originates in the macro `$crate::sqlx_macros::expand_query` which comes from the expansion of the macro `sqlx::query` (in Nightly builds, run with -Z macro-backtrace for more info)
error: could not compile `horae` (bin "horae" test) due to 1 previous error
warning: build failed, waiting for other jobs to finish...
failed checks.x86_64-linux.clippy 1m 56s
horae-clippy-0.1.0: error: `SQLX_OFFLINE=true` but there is no cached data for this query, run `cargo sqlx prepare` to update the query cache or unset `SQLX_OFF …
horae-clippy-0.1.0:
error: `SQLX_OFFLINE=true` but there is no cached data for this query, run `cargo sqlx prepare` to update the query cache or unset `SQLX_OFFLINE`
  --> crates/horae/src/harvest/pagination_tests/client_permissions.rs:55:5
   |
55 |     sqlx::query!("UPDATE clients SET active=false WHERE id=$1", ids.client_id)
   |     ^^^^^^^^^^^^^^^^^^^^^^^^^^^^^^^^^^^^^^^^^^^^^^^^^^^^^^^^^^^^^^^^^^^^^^^^^^
   |
   = note: this error originates in the macro `$crate::sqlx_macros::expand_query` which comes from the expansion of the macro `sqlx::query` (in Nightly builds, run with -Z macro-backtrace for more info)
error: could not compile `horae` (bin "horae" test) due to 1 previous error
failed checks.x86_64-linux.sqlx-prepare 1m 52s
horae-sqlx-prepare-0.1.0: Applied 43/migrate permission change receipts (3.146258ms) Applied 44/migrate permission management assignments (4.167985ms) Applied 4 …
horae-sqlx-prepare-0.1.0:
Applied 43/migrate permission change receipts (3.146258ms)
Applied 44/migrate permission management assignments (4.167985ms)
Applied 47/migrate permission template name collation (1.965498ms)
+++ command cargo sqlx prepare --workspace --check -- --features server --all-targets
   Compiling horae v0.1.0 (/build/source/crates/horae)
    Checking horae-core v0.1.0 (/build/source/crates/core)
    Finished `dev` profile [unoptimized + debuginfo] target(s) in 1m 37s
error: prepare check failed: .sqlx is missing one or more queries; you should re-run sqlx prepare
failed checks.x86_64-linux.tests 1m 58s
horae-tests-0.1.0: error: `SQLX_OFFLINE=true` but there is no cached data for this query, run `cargo sqlx prepare` to update the query cache or unset `SQLX_OFFL …
horae-tests-0.1.0:
error: `SQLX_OFFLINE=true` but there is no cached data for this query, run `cargo sqlx prepare` to update the query cache or unset `SQLX_OFFLINE`
  --> crates/horae/src/harvest/pagination_tests/client_permissions.rs:55:5
   |
55 |     sqlx::query!("UPDATE clients SET active=false WHERE id=$1", ids.client_id)
   |     ^^^^^^^^^^^^^^^^^^^^^^^^^^^^^^^^^^^^^^^^^^^^^^^^^^^^^^^^^^^^^^^^^^^^^^^^^^
   |
   = note: this error originates in the macro `$crate::sqlx_macros::expand_query` which comes from the expansion of the macro `sqlx::query` (in Nightly builds, run with -Z macro-backtrace for more info)
error: could not compile `horae` (bin "horae" test) due to 1 previous error
4 cancelled
cancelled attributes
status attribute duration
loading…
6 succeeded
succeeded attributes
status attribute duration
loading…
4 already built
skipped attributes
status attribute duration
loading…