failed attributes
| status |
attribute |
duration |
| failed |
checks.aarch64-linux.e2e
|
54m 28s |
vm-test-run-horae-e2e:
!!! File "<string>", line 102, in wait_sql
!!! server.wait_until_succeeds(
!!!
!!! RequestedAssertionFailed: action timed out afte …
vm-test-run-horae-e2e:
!!! File "<string>", line 102, in wait_sql
!!! server.wait_until_succeeds(
!!!
!!! RequestedAssertionFailed: action timed out after 94.78 seconds (timeout=90)
cleanup
kill QemuMachine (pid 12)
server # qemu-system-aarch64: terminating on signal 15 from pid 6 (/nix/store/smwd56pl54f0pcjdspgh5vnf20c8xwsc-python3-3.13.13/bin/python3.13)
(finished: cleanup, in 0.22 seconds)
|
| failed |
checks.aarch64-linux.e2e-oidc
|
54m 25s |
vm-test-run-horae-e2e-oidc:
!!! File "<string>", line 5, in <module>
!!! retry(lambda _: "connecting to host..." in server.get_console_log(), timeout_seco …
vm-test-run-horae-e2e-oidc:
!!! File "<string>", line 5, in <module>
!!! retry(lambda _: "connecting to host..." in server.get_console_log(), timeout_seconds=900)
!!!
!!! RequestedAssertionFailed: action timed out after 900.18 seconds (timeout=900)
cleanup
kill QemuMachine (pid 12)
server # qemu-system-aarch64: terminating on signal 15 from pid 6 (/nix/store/smwd56pl54f0pcjdspgh5vnf20c8xwsc-python3-3.13.13/bin/python3.13)
(finished: cleanup, in 0.23 seconds)
|
| failed |
checks.aarch64-linux.tests
|
12m 37s |
horae-tests-0.1.0:
thread 'server_fns::importers::authorization_tests::job_endpoints_enforce_session_role_and_organization' (4891) panicked at crates/horae/src/ …
horae-tests-0.1.0:
thread 'server_fns::importers::authorization_tests::job_endpoints_enforce_session_role_and_organization' (4891) panicked at crates/horae/src/server_fns/importers/authorization_tests/cli.rs:75:13:
assertion `left == right` failed: ["import", "harvest-csv", "/build/.tmpJUot8C/source.csv", "--dry-run"]: {"error":{"category":"indeterminate_submission","message":"Submission acknowledgement unavailable; resubmit identical input with the same request ID"},"operation":"import.harvest-csv","outcome":"error","request_id":"01a11689-2838-71d2-bdee-7e98fc56b856","version":1}
left: 6
right: 1
failures:
server_fns::importers::authorization_tests::job_endpoints_enforce_session_role_and_organization
test result: FAILED. 925 passed; 1 failed; 11 ignored; 0 measured; 0 filtered out; finished in 134.84s
error: test failed, to rerun pass `-p horae --bin horae`
|