nixbot

builds

succeeded setup checks.x86_64-linux.tests · build #234 · raw

1this derivation will be built:2 /nix/store/7iln12pif054kc785anmrafvk17b3fla-horae-tests-0.1.0.drv3error: Cannot build '/nix/store/7iln12pif054kc785anmrafvk17b3fla-horae-tests-0.1.0.drv'.4 Reason: builder failed with exit code 101.5 Output paths:6 /nix/store/wnxcvm74q67p34ywpg98qjjscr9v1c03-horae-tests-0.1.07 Last 25 log lines:8 > test reports::limits::tests::export_queries_are_read_only_and_have_a_database_deadline ... ok9 > test jobs::report::tests::report_fragments_survive_until_the_owning_job_expires ... ok10 > test reports::streaming::database_tests::dropping_streamed_timesheet_closes_its_database_connection ... ok11 >12 > failures:13 >14 > ---- importers::harvest::engine_tests::csv_streaming::durable_csv_resumes_committed_batches_without_recounting_duplicate_rows stdout ----15 >16 > thread 'importers::harvest::engine_tests::csv_streaming::durable_csv_resumes_committed_batches_without_recounting_duplicate_rows' (1994) panicked at crates/horae/src/importers/harvest/engine_tests/csv_streaming.rs:338:5:17 > a durable batch must commit before source EOF18 > note: run with `RUST_BACKTRACE=1` environment variable to display a backtrace19 >20 > ---- importers::harvest::engine_tests::csv_streaming::durable_csv_preview_rejects_a_stale_next_batch stdout ----21 >22 > thread 'importers::harvest::engine_tests::csv_streaming::durable_csv_preview_rejects_a_stale_next_batch' (1984) panicked at crates/horae/src/importers/harvest/engine_tests/csv_streaming.rs:404:18:23 > called `Result::unwrap()` on an `Err` value: Elapsed(())24 >25 >26 > failures:27 > importers::harvest::engine_tests::csv_streaming::durable_csv_preview_rejects_a_stale_next_batch28 > importers::harvest::engine_tests::csv_streaming::durable_csv_resumes_committed_batches_without_recounting_duplicate_rows29 >30 > test result: FAILED. 820 passed; 2 failed; 11 ignored; 0 measured; 0 filtered out; finished in 147.09s31 >32 > error: test failed, to rerun pass `-p horae --bin horae`33 For full logs, run:34 nix log /nix/store/7iln12pif054kc785anmrafvk17b3fla-horae-tests-0.1.0.drv