nixbot

builds

succeeded setup checks.x86_64-linux.tests · build #233 · raw

1this derivation will be built:2 /nix/store/1wzx7vmmrdmq1z5z8d01g0az6969664g-horae-tests-0.1.0.drv3error: Cannot build '/nix/store/1wzx7vmmrdmq1z5z8d01g0az6969664g-horae-tests-0.1.0.drv'.4 Reason: builder failed with exit code 101.5 Output paths:6 /nix/store/2806whf3lfalarsnrakjfp7jnfgc89na-horae-tests-0.1.07 Last 25 log lines:8 > ---- importers::harvest::engine_tests::csv_streaming::durable_csv_cancel_preserves_its_completed_batches_for_manual_retry stdout ----9 >10 > thread 'importers::harvest::engine_tests::csv_streaming::durable_csv_cancel_preserves_its_completed_batches_for_manual_retry' (1976) panicked at crates/horae/src/importers/harvest/engine_tests/csv_streaming.rs:494:5:11 > a durable batch must commit before source EOF12 > note: run with `RUST_BACKTRACE=1` environment variable to display a backtrace13 >14 > ---- importers::harvest::engine_tests::csv_streaming::durable_csv_preview_cancel_preserves_simulation_for_manual_retry stdout ----15 >16 > thread 'importers::harvest::engine_tests::csv_streaming::durable_csv_preview_cancel_preserves_simulation_for_manual_retry' (2001) panicked at crates/horae/src/importers/harvest/engine_tests/csv_streaming.rs:494:5:17 > a durable batch must commit before source EOF18 >19 > ---- importers::harvest::engine_tests::csv_streaming::durable_csv_preview_resumes_after_a_crash_without_recounting_rows stdout ----20 >21 > thread 'importers::harvest::engine_tests::csv_streaming::durable_csv_preview_resumes_after_a_crash_without_recounting_rows' (2173) panicked at crates/horae/src/importers/harvest/engine_tests/csv_streaming.rs:494:5:22 > a durable batch must commit before source EOF23 >24 >25 > failures:26 > importers::harvest::engine_tests::csv_streaming::durable_csv_cancel_preserves_its_completed_batches_for_manual_retry27 > importers::harvest::engine_tests::csv_streaming::durable_csv_preview_cancel_preserves_simulation_for_manual_retry28 > importers::harvest::engine_tests::csv_streaming::durable_csv_preview_resumes_after_a_crash_without_recounting_rows29 >30 > test result: FAILED. 859 passed; 3 failed; 11 ignored; 0 measured; 0 filtered out; finished in 168.35s31 >32 > error: test failed, to rerun pass `-p horae --bin horae`33 For full logs, run:34 nix log /nix/store/1wzx7vmmrdmq1z5z8d01g0az6969664g-horae-tests-0.1.0.drv