nixbot

builds

numtide/horae build #21 failed

branch master · PR #227 · commit 142eda198f · · took 2h 43m · eval 24s

eval warnings 1 kind · 6 occurrences
  • warn Nixpkgs 26.05 will be the last release to support x86_64-darwin; see https://nixos.org/… ×6

5 failed
failed attributes
status attribute duration
failed checks.aarch64-darwin.e2e 1h 5m
setup: /nix/store/3z86mcy73jmf267n0mw8pizxfxmagpmj-closure-info.drv /nix/store/xw45psqvy7liafaxqv32brsr0l0i8bkq-run-nixos-vm.drv /nix/store/fvxmqg9h6plxdp …
setup:
  /nix/store/3z86mcy73jmf267n0mw8pizxfxmagpmj-closure-info.drv
  /nix/store/xw45psqvy7liafaxqv32brsr0l0i8bkq-run-nixos-vm.drv
  /nix/store/fvxmqg9h6plxdprx9agy6s6gdpbvxkz8-nixos-vm.drv
  /nix/store/nrcymksxm60rsvnr7lvh7g57iy2azx4j-driverConfiguration.json.drv
  /nix/store/grqj07rnjaqfyvkkywr8wql9ayiz5ayb-nixos-test-driver-horae-e2e.drv
  /nix/store/k5a1nd1ggnqy9bb0lggqwnm3jz298s38-vm-test-run-horae-e2e.drv
Failed to find a machine for remote build!
derivation: k5a1nd1ggnqy9bb0lggqwnm3jz298s38-vm-test-run-horae-e2e.drv
required (system, features): (aarch64-darwin, [apple-virt, nixos-test])
12 available machines:
(systems, maxjobs, supportedFeatures, mandatoryFeatures)
([aarch64-darwin], 8, [big-parallel, kvm, nixos-test, uid-range], [])
([aarch64-darwin], 8, [big-parallel, kvm, nixos-test, uid-range], [])
([aarch64-darwin], 8, [big-parallel, kvm, nixos-test, uid-range], [])
([aarch64-darwin], 8, [big-parallel, kvm, nixos-test, uid-range], [])
([aarch64-linux], 8, [big-parallel, kvm, nixos-test, uid-range], [])
([aarch64-linux], 8, [big-parallel…
error: Cannot build '/nix/store/k5a1nd1ggnqy9bb0lggqwnm3jz298s38-vm-test-run-horae-e2e.drv'.
       Reason: platform mismatch
       Required system: 'aarch64-darwin'
       Current system: 'x86_64-linux'
       Reason: missing system features
       Required features: {apple-virt, nixos-test}
       Available features: {benchmark, big-parallel, ca-derivations, kvm, nixos-test, recursive-nix, uid-range}
failed checks.aarch64-darwin.e2e-oidc 1h 3m
setup: /nix/store/pgd6n6jfrbdpfc6n1fixla7jpdrha0iy-closure-info.drv /nix/store/0n1gcqrlk7kr3mlycl3y5szla122ygy6-run-nixos-vm.drv /nix/store/7v6l5skcyr4wi2 …
setup:
  /nix/store/pgd6n6jfrbdpfc6n1fixla7jpdrha0iy-closure-info.drv
  /nix/store/0n1gcqrlk7kr3mlycl3y5szla122ygy6-run-nixos-vm.drv
  /nix/store/7v6l5skcyr4wi2z3hg6gzp54cyk5d6bs-nixos-vm.drv
  /nix/store/grf427159lsqzrk0fjvchs925f6brf62-driverConfiguration.json.drv
  /nix/store/9x0j5pw95inzkgc3r2kmc2bb1i8kvkbk-nixos-test-driver-horae-e2e-oidc.drv
  /nix/store/z9mv6c4sh3mcfwhhy2wwap4h8lxdd5yg-vm-test-run-horae-e2e-oidc.drv
Failed to find a machine for remote build!
derivation: z9mv6c4sh3mcfwhhy2wwap4h8lxdd5yg-vm-test-run-horae-e2e-oidc.drv
required (system, features): (aarch64-darwin, [apple-virt, nixos-test])
12 available machines:
(systems, maxjobs, supportedFeatures, mandatoryFeatures)
([aarch64-darwin], 8, [big-parallel, kvm, nixos-test, uid-range], [])
([aarch64-darwin], 8, [big-parallel, kvm, nixos-test, uid-range], [])
([aarch64-darwin], 8, [big-parallel, kvm, nixos-test, uid-range], [])
([aarch64-darwin], 8, [big-parallel, kvm, nixos-test, uid-range], [])
([aarch64-linux], 8, [big-parallel, kvm, nixos-test, uid-range], [])
([aarch64-linux], 8, [big-par…
error: Cannot build '/nix/store/z9mv6c4sh3mcfwhhy2wwap4h8lxdd5yg-vm-test-run-horae-e2e-oidc.drv'.
       Reason: platform mismatch
       Required system: 'aarch64-darwin'
       Current system: 'x86_64-linux'
       Reason: missing system features
       Required features: {apple-virt, nixos-test}
       Available features: {benchmark, big-parallel, ca-derivations, kvm, nixos-test, recursive-nix, uid-range}
failed checks.aarch64-darwin.tests 38m 18s
horae-tests-0.1.0: called `Result::unwrap()` on an `Err` value: error communicating with database: Socket is not connected (os error 57) Caused by: Socket i …
horae-tests-0.1.0:
called `Result::unwrap()` on an `Err` value: error communicating with database: Socket is not connected (os error 57)
Caused by:
    Socket is not connected (os error 57)
note: run with `RUST_BACKTRACE=1` environment variable to display a backtrace
failures:
    importers::harvest::credentials::tests::completed_credential_changes_allow_immediate_retries
test result: FAILED. 825 passed; 1 failed; 10 ignored; 0 measured; 0 filtered out; finished in 60.34s
error: test failed, to rerun pass `-p horae --bin horae`
failed checks.aarch64-linux.e2e 8m 18s
vm-test-run-horae-e2e: ) ^ File "/nix/store/yv2q67grjgrymd498bgdfzlhyaj04cqv-nixos-test-driver-1.1/lib/python3.13/site-packages/test_driver/machine/__ …
vm-test-run-horae-e2e:
    )
    ^
  File "/nix/store/yv2q67grjgrymd498bgdfzlhyaj04cqv-nixos-test-driver-1.1/lib/python3.13/site-packages/test_driver/machine/__init__.py", line 878, in _execute
    self.connect()
    ~~~~~~~~~~~~^^
  File "/nix/store/yv2q67grjgrymd498bgdfzlhyaj04cqv-nixos-test-driver-1.1/lib/python3.13/site-packages/test_driver/machine/__init__.py", line 1057, in connect
    raise RuntimeError("Shell did not start in time")
RuntimeError: Shell did not start in time
failed checks.aarch64-linux.e2e-oidc 8m 32s
vm-test-run-horae-e2e-oidc: ) ^ File "/nix/store/yv2q67grjgrymd498bgdfzlhyaj04cqv-nixos-test-driver-1.1/lib/python3.13/site-packages/test_driver/machi …
vm-test-run-horae-e2e-oidc:
    )
    ^
  File "/nix/store/yv2q67grjgrymd498bgdfzlhyaj04cqv-nixos-test-driver-1.1/lib/python3.13/site-packages/test_driver/machine/__init__.py", line 878, in _execute
    self.connect()
    ~~~~~~~~~~~~^^
  File "/nix/store/yv2q67grjgrymd498bgdfzlhyaj04cqv-nixos-test-driver-1.1/lib/python3.13/site-packages/test_driver/machine/__init__.py", line 1057, in connect
    raise RuntimeError("Shell did not start in time")
RuntimeError: Shell did not start in time
18 succeeded
succeeded attributes
status attribute duration
loading…
6 already built
skipped attributes
status attribute duration
loading…