failed attributes
| status |
attribute |
duration |
| failed |
checks.aarch64-linux.clippy
|
5m 10s |
horae-clippy-0.1.0:
error[E0425]: cannot find type `UserListItem` in module `models::user`
--> crates/horae/tests/scoped_reports_ui.rs:1242:66
|
1242 | …
horae-clippy-0.1.0:
error[E0425]: cannot find type `UserListItem` in module `models::user`
--> crates/horae/tests/scoped_reports_ui.rs:1242:66
|
1242 | pub async fn list_users(_: bool) -> Result<Vec<models::user::UserListItem>, ServerFnError> {
| ^^^^^^^^^^^^ not found in `models::user`
For more information about this error, try `rustc --explain E0425`.
error: could not compile `horae` (test "scoped_reports_ui") due to 2 previous errors
warning: build failed, waiting for other jobs to finish...
|
| failed |
checks.aarch64-linux.sqlx-prepare
|
4m 27s |
horae-sqlx-prepare-0.1.0:
--> crates/horae/tests/scoped_reports_ui.rs:1242:66
|
1242 | pub async fn list_users(_: bool) -> Result<Vec<models::user: …
horae-sqlx-prepare-0.1.0:
--> crates/horae/tests/scoped_reports_ui.rs:1242:66
|
1242 | pub async fn list_users(_: bool) -> Result<Vec<models::user::UserListItem>, ServerFnError> {
| ^^^^^^^^^^^^ not found in `models::user`
For more information about this error, try `rustc --explain E0425`.
error: could not compile `horae` (test "scoped_reports_ui") due to 2 previous errors
warning: build failed, waiting for other jobs to finish...
error: `cargo check` failed with status: exit status: 101
|
| failed |
checks.aarch64-linux.tests
|
7m 44s |
horae-tests-0.1.0:
error[E0425]: cannot find type `UserListItem` in module `models::user`
--> crates/horae/tests/scoped_reports_ui.rs:1242:66
|
1242 | …
horae-tests-0.1.0:
error[E0425]: cannot find type `UserListItem` in module `models::user`
--> crates/horae/tests/scoped_reports_ui.rs:1242:66
|
1242 | pub async fn list_users(_: bool) -> Result<Vec<models::user::UserListItem>, ServerFnError> {
| ^^^^^^^^^^^^ not found in `models::user`
For more information about this error, try `rustc --explain E0425`.
error: could not compile `horae` (test "scoped_reports_ui") due to 2 previous errors
warning: build failed, waiting for other jobs to finish...
|
| failed |
checks.x86_64-linux.clippy
|
3m 28s |
horae-clippy-0.1.0:
error[E0425]: cannot find type `UserListItem` in module `models::user`
--> crates/horae/tests/scoped_reports_ui.rs:1242:66
|
1242 | …
horae-clippy-0.1.0:
error[E0425]: cannot find type `UserListItem` in module `models::user`
--> crates/horae/tests/scoped_reports_ui.rs:1242:66
|
1242 | pub async fn list_users(_: bool) -> Result<Vec<models::user::UserListItem>, ServerFnError> {
| ^^^^^^^^^^^^ not found in `models::user`
For more information about this error, try `rustc --explain E0425`.
error: could not compile `horae` (test "scoped_reports_ui") due to 2 previous errors
warning: build failed, waiting for other jobs to finish...
|
| failed |
checks.x86_64-linux.sqlx-prepare
|
2m 50s |
horae-sqlx-prepare-0.1.0:
--> crates/horae/tests/scoped_reports_ui.rs:1242:66
|
1242 | pub async fn list_users(_: bool) -> Result<Vec<models::user: …
horae-sqlx-prepare-0.1.0:
--> crates/horae/tests/scoped_reports_ui.rs:1242:66
|
1242 | pub async fn list_users(_: bool) -> Result<Vec<models::user::UserListItem>, ServerFnError> {
| ^^^^^^^^^^^^ not found in `models::user`
For more information about this error, try `rustc --explain E0425`.
error: could not compile `horae` (test "scoped_reports_ui") due to 2 previous errors
warning: build failed, waiting for other jobs to finish...
error: `cargo check` failed with status: exit status: 101
|
| failed |
checks.x86_64-linux.tests
|
4m 17s |
horae-tests-0.1.0:
error[E0425]: cannot find type `UserListItem` in module `models::user`
--> crates/horae/tests/scoped_reports_ui.rs:1242:66
|
1242 | …
horae-tests-0.1.0:
error[E0425]: cannot find type `UserListItem` in module `models::user`
--> crates/horae/tests/scoped_reports_ui.rs:1242:66
|
1242 | pub async fn list_users(_: bool) -> Result<Vec<models::user::UserListItem>, ServerFnError> {
| ^^^^^^^^^^^^ not found in `models::user`
For more information about this error, try `rustc --explain E0425`.
error: could not compile `horae` (test "scoped_reports_ui") due to 2 previous errors
warning: build failed, waiting for other jobs to finish...
|