nixbot

builds

failed horae-tests-0.1.0 checks.aarch64-linux.tests · build #171 · raw

1elastic-arm-11e60d15: building ipkyxpmcqs438i15h4hdhijw4jp7ayfg-horae-tests-0.1.0.drv
unpackPhase
2unpacking source archive /nix/store/aq60c5wqkhgchvix091ywy0dcq04l7m9-source3source root is source
patchPhase
4Executing configureCargoCommonVars5decompressing cargo artifacts from /nix/store/iz15gsb1vnxn8iiqaks5c263ms6mxl74-horae-checks-deps-0.1.0/target.tar.zst to target6patchPhase completed in 30 seconds
configurePhase
7will append /build/source/.cargo-home/config.toml with contents of /nix/store/kqxgprj432hnlh0pqlk1779vyabfmw4i-vendor-cargo-deps/config.toml8default configurePhase, nothing to do
buildPhase
9+++ command cargo nextest run -p horae-core10 Compiling proc-macro2 v1.0.10611 Compiling serde_core v1.0.22812 Compiling serde v1.0.22813 Compiling num-traits v0.2.1914 Compiling quote v1.0.4615 Compiling syn v2.0.11816 Compiling uuid v1.23.417 Compiling serde_derive v1.0.22818 Compiling thiserror-impl v2.0.1819 Compiling thiserror v2.0.1820 Compiling chrono v0.4.4521 Compiling horae-core v0.1.0 (/build/source/crates/core)22 Finished `test` profile [unoptimized + debuginfo] target(s) in 16.12s23------------24 Nextest run ID 06dde5b7-597e-4ade-96fc-e1063e512046 with nextest profile: default25 Starting 189 tests across 1 binary26 Running [ 00:00:00] 0/189: 8 running, 0 passed, 0 skipped 27 [ 00:00:00] horae-core ed_alert_threshold_is_exact_without_rounding28 [ 00:00:00] horae-core ::a_single_jump_announces_every_crossed_band29 [ 00:00:00] horae-core ert_accepts_zero_percent_but_not_zero_budget30 [ 00:00:00] horae-core jects_invalid_inputs_and_widens_large_values31 [ 00:00:00] horae-core ::tests::current_band_is_the_highest_reached32 [ 00:00:00] horae-core percentage_rounds_clamps_and_never_overflows33 [ 00:00:00] horae-core dget::tests::each_crossing_is_announced_once34 Running [ 00:00:00] => 29/189: 8 running, 29 passed, 0 skipped 35 [ 00:00:00] horae-core ests::parse_round_trips_each_minute_in_a_day36 [ 00:00:00] horae-core s::conversion_matches_exact_scaled_rationals37 [ 00:00:00] horae-core he_i64_boundary_and_rejects_rounding_past_it38 [ 00:00:00] horae-core epresentable_scaled_values_without_panicking39 [ 00:00:00] horae-core rsion_reports_precision_and_numerator_limits40 [ 00:00:00] horae-core harvest::convert::tests::garbage_is_rejected41 [ 00:00:00] horae-core n_fraction_straddles_the_half_minute_exactly42 PASS [ 0.010s] horae-core budget::tests::configured_alert_rejects_invalid_inputs_and_widens_large_values43 PASS [ 0.013s] horae-core budget::tests::a_single_jump_announces_every_crossed_band44 PASS [ 0.013s] horae-core budget::tests::display_percentage_rounds_clamps_and_never_overflows45 PASS [ 0.016s] horae-core budget::tests::configured_alert_threshold_is_exact_without_rounding46 PASS [ 0.017s] horae-core budget::tests::each_crossing_is_announced_once47 PASS [ 0.008s] horae-core budget::tests::large_values_do_not_overflow48 PASS [ 0.018s] horae-core budget::tests::drop_below_a_band_does_not_fire_but_current_resets49 PASS [ 0.008s] horae-core budget::tests::over_budget_fires_even_without_a_configured_100_band50 PASS [ 0.011s] horae-core budget::tests::no_band_for_zero_or_missing_budget51 PASS [ 0.008s] horae-core client::tests::default_rate_rejects_negative_fractional_cent_overflow_and_invalid_text52 PASS [ 0.008s] horae-core client::tests::profile_accepts_supported_currencies_and_unicode_character_limit53 PASS [ 0.026s] horae-core budget::tests::configured_alert_accepts_zero_percent_but_not_zero_budget54 PASS [ 0.013s] horae-core client::tests::default_rate_preserves_absence_zero_and_exact_large_amounts55 PASS [ 0.029s] horae-core budget::tests::current_band_is_the_highest_reached56 PASS [ 0.011s] horae-core client::tests::optional_text_normalizes_only_blank_fields57 PASS [ 0.005s] horae-core client::tests::profile_rejects_unsupported_currency_and_null_billing_fields58 PASS [ 0.011s] horae-core duration::tests::format_clamps_negative_to_zero59 PASS [ 0.011s] horae-core duration::tests::format_hhmm_pads_minutes60 PASS [ 0.015s] horae-core client::tests::profile_rejects_blank_overlong_and_null_names61 PASS [ 0.008s] horae-core duration::tests::minutes_between_is_exact_no_minimum62 PASS [ 0.008s] horae-core duration::tests::parse_colon63 PASS [ 0.012s] horae-core duration::tests::format_round_trip64 PASS [ 0.015s] horae-core duration::tests::parse_decimal_rounds_half_minutes_exactly65 PASS [ 0.008s] horae-core duration::tests::parse_rejects_excessive_decimal_precision_and_numerator66 PASS [ 0.016s] horae-core duration::tests::parse_decimal67 PASS [ 0.008s] horae-core duration::tests::parse_rejects_negative_non_finite_and_malformed_values68 PASS [ 0.008s] horae-core importers::harvest::convert::tests::conversion_handles_high_precision_without_intermediate_overflow69 Running [ 00:00:00] => 29/189: 8 running, 29 passed, 0 skipped 70 [ 00:00:00] horae-core ests::parse_round_trips_each_minute_in_a_day71 [ 00:00:00] horae-core s::conversion_matches_exact_scaled_rationals72 [ 00:00:00] horae-core he_i64_boundary_and_rejects_rounding_past_it73 [ 00:00:00] horae-core epresentable_scaled_values_without_panicking74 [ 00:00:00] horae-core rsion_reports_precision_and_numerator_limits75 [ 00:00:00] horae-core harvest::convert::tests::garbage_is_rejected76 [ 00:00:00] horae-core n_fraction_straddles_the_half_minute_exactly77 PASS [ 0.010s] horae-core duration::tests::parse_preserves_u32_boundary_without_saturating78 PASS [ 0.010s] horae-core duration::tests::parse_rejects_colon_overflow_without_panicking79 Running [ 00:00:00] => 29/189: 8 running, 29 passed, 0 skipped 80 [ 00:00:00] horae-core ests::parse_round_trips_each_minute_in_a_day81 [ 00:00:00] horae-core s::conversion_matches_exact_scaled_rationals82 [ 00:00:00] horae-core he_i64_boundary_and_rejects_rounding_past_it83 [ 00:00:00] horae-core epresentable_scaled_values_without_panicking84 [ 00:00:00] horae-core rsion_reports_precision_and_numerator_limits85 [ 00:00:00] horae-core harvest::convert::tests::garbage_is_rejected86 [ 00:00:00] horae-core n_fraction_straddles_the_half_minute_exactly87 Running [ 00:00:00] ==> 54/189: 8 running, 29 passed, 0 skipped 88 [ 00:00:00] horae-core ests::parse_round_trips_each_minute_in_a_day89 [ 00:00:00] horae-core s::conversion_matches_exact_scaled_rationals90 [ 00:00:00] horae-core he_i64_boundary_and_rejects_rounding_past_it91 [ 00:00:00] horae-core epresentable_scaled_values_without_panicking92 [ 00:00:00] horae-core rsion_reports_precision_and_numerator_limits93 [ 00:00:00] horae-core harvest::convert::tests::garbage_is_rejected94 [ 00:00:00] horae-core n_fraction_straddles_the_half_minute_exactly95 PASS [ 0.010s] horae-core importers::harvest::convert::tests::garbage_is_rejected96 PASS [ 0.019s] horae-core duration::tests::parse_round_trips_each_minute_in_a_day97 PASS [ 0.004s] horae-core importers::harvest::convert::tests::leading_and_trailing_forms_parse98 PASS [ 0.015s] horae-core importers::harvest::convert::tests::high_precision_fraction_straddles_the_half_minute_exactly99 PASS [ 0.016s] horae-core importers::harvest::convert::tests::conversion_rejects_unrepresentable_scaled_values_without_panicking100 PASS [ 0.016s] horae-core importers::harvest::convert::tests::conversion_preserves_the_i64_boundary_and_rejects_rounding_past_it101 PASS [ 0.015s] horae-core importers::harvest::convert::tests::hours_common_values_are_exact102 PASS [ 0.004s] horae-core importers::harvest::convert::tests::negative_is_rejected103 PASS [ 0.024s] horae-core importers::harvest::convert::tests::conversion_reports_precision_and_numerator_limits104 PASS [ 0.018s] horae-core importers::harvest::convert::tests::hours_round_trip_against_exporter_transform105 PASS [ 0.013s] horae-core importers::harvest::convert::tests::money_round_trip_against_exporter_transform106 PASS [ 0.013s] horae-core importers::harvest::convert::tests::money_common_values_are_exact107 PASS [ 0.013s] horae-core importers::harvest::convert::tests::money_rounds_third_decimal_half_up108 PASS [ 0.013s] horae-core importers::harvest::convert::tests::round_half_up_at_the_boundary109 PASS [ 0.005s] horae-core importers::harvest::keys::tests::composite_components_do_not_collide110 PASS [ 0.009s] horae-core importers::harvest::keys::tests::client_key_equal_across_case_and_whitespace111 PASS [ 0.008s] horae-core importers::harvest::keys::tests::project_key_prefers_code_when_present112 PASS [ 0.011s] horae-core importers::harvest::keys::tests::normalize_matches_sql_harvest_norm_contract113 PASS [ 0.012s] horae-core importers::harvest::keys::tests::occurrence_counter_keys_are_independent114 PASS [ 0.015s] horae-core importers::harvest::keys::tests::project_key_falls_back_to_client_and_name115 PASS [ 0.016s] horae-core importers::harvest::keys::tests::occurrence_counter_numbers_repeats_from_zero116 PASS [ 0.005s] horae-core importers::harvest::types::account_switch_tests::account_switch_requires_binding_and_no_imports_or_active_work117 PASS [ 0.019s] horae-core importers::harvest::keys::tests::normalize_trims_and_case_folds118 PASS [ 0.018s] horae-core importers::harvest::keys::tests::task_key_shared_across_projects119 PASS [ 0.007s] horae-core importers::harvest::types::tests::archived_errors_and_new_inline_errors_reconcile_across_batches120 Running [ 00:00:00] ==> 56/189: 8 running, 56 passed, 0 skipped 121 [ 00:00:00] horae-core s::conversion_matches_exact_scaled_rationals122 [ 00:00:00] horae-core ts::time_entry_key_distinguishes_and_matches123 [ 00:00:00] horae-core _when_an_errored_count_has_no_reported_error124 [ 00:00:00] horae-core cation_handles_empty_zero_and_full_discounts125 [ 00:00:00] horae-core conserves_header_amount_and_bounds_each_line126 [ 00:00:00] horae-core rejects_negative_lines_and_subtotal_overflow127 [ 00:00:00] horae-core tion_supports_maximum_representable_subtotal128 PASS [ 0.008s] horae-core importers::harvest::types::tests::reconciles_when_errored_counts_match_collected_errors129 PASS [ 0.008s] horae-core importers::harvest::types::tests::import_modes_display_their_wire_names130 Running [ 00:00:00] ==> 56/189: 8 running, 56 passed, 0 skipped 131 [ 00:00:00] horae-core s::conversion_matches_exact_scaled_rationals132 [ 00:00:00] horae-core ts::time_entry_key_distinguishes_and_matches133 [ 00:00:00] horae-core _when_an_errored_count_has_no_reported_error134 [ 00:00:00] horae-core cation_handles_empty_zero_and_full_discounts135 [ 00:00:00] horae-core conserves_header_amount_and_bounds_each_line136 [ 00:00:00] horae-core rejects_negative_lines_and_subtotal_overflow137 [ 00:00:00] horae-core tion_supports_maximum_representable_subtotal138 Running [ 00:00:00] ===> 83/189: 8 running, 83 passed, 0 skipped 139 [ 00:00:00] horae-core s::conversion_matches_exact_scaled_rationals140 [ 00:00:00] horae-core format_cents_plain_keeps_sign_below_one_unit141 [ 00:00:00] horae-core rse_cents_is_exact_where_a_float_would_drift142 [ 00:00:00] horae-core rse_cents_reads_whole_and_fractional_amounts143 [ 00:00:00] horae-core se_cents_tolerates_grouping_spaces_and_signs144 [ 00:00:00] horae-core al_scope_even_when_both_domains_are_readable145 [ 00:00:00] horae-core atalog_grants_cannot_substitute_for_approval146 PASS [ 0.012s] horae-core importers::harvest::types::tests::does_not_reconcile_when_an_errored_count_has_no_reported_error147 PASS [ 0.018s] horae-core importers::harvest::keys::tests::time_entry_key_distinguishes_and_matches148 PASS [ 0.015s] horae-core invoice::tests::discount_allocation_rejects_negative_lines_and_subtotal_overflow149 PASS [ 0.017s] horae-core invoice::tests::discount_allocation_handles_empty_zero_and_full_discounts150 PASS [ 0.010s] horae-core invoice::tests::discount_allocation_uses_largest_remainder_then_stable_source_order151 PASS [ 0.020s] horae-core invoice::tests::discount_allocation_conserves_header_amount_and_bounds_each_line152 PASS [ 0.014s] horae-core invoice::tests::discount_allocation_supports_maximum_representable_subtotal153 PASS [ 0.013s] horae-core invoice::tests::discounted_fee_contribution_leaves_discount_available154 PASS [ 0.013s] horae-core invoice::tests::invoice_adjustments_apply_discount_before_non_compounding_taxes155 PASS [ 0.008s] horae-core invoice::tests::invoice_adjustments_reject_negative_subtotal_and_overflow156 PASS [ 0.006s] horae-core invoice::tests::line_amount_rejects_unrepresentable_results157 PASS [ 0.010s] horae-core invoice::tests::line_amount_exact_hour158 PASS [ 0.014s] horae-core invoice::tests::line_amount_90_minutes159 PASS [ 0.011s] horae-core invoice::tests::line_amount_accepts_large_representable_amounts160 PASS [ 0.015s] horae-core invoice::tests::invoice_adjustments_round_components_half_up161 PASS [ 0.011s] horae-core invoice::tests::line_amount_odd_minutes162 PASS [ 0.018s] horae-core invoice::tests::line_amount_half_hour163 PASS [ 0.008s] horae-core invoice::tests::line_amount_zero_minutes164 PASS [ 0.008s] horae-core invoice::tests::line_amount_rounds_half_cents_up_not_to_even165 PASS [ 0.012s] horae-core invoice::tests::resolve_rate_cascade166 PASS [ 0.013s] horae-core invoice::tests::line_amount_zero_rate167 PASS [ 0.013s] horae-core invoice::tests::selected_rate_mode_ignores_unselected_rate_sources168 PASS [ 0.008s] horae-core money::tests::addition_rejects_overflow_in_both_directions169 PASS [ 0.009s] horae-core money::tests::addition_retains_currency_checks_and_representable_boundaries170 PASS [ 0.021s] horae-core invoice::tests::selected_rate_keeps_zero_and_explicit_missing_project_rate171 PASS [ 0.008s] horae-core money::tests::parse_cents_rejects_what_it_cannot_represent172 PASS [ 0.016s] horae-core money::tests::format_cents_groups_thousands_and_keeps_sign173 Running [ 00:00:00] ===> 83/189: 8 running, 83 passed, 0 skipped 174 [ 00:00:00] horae-core s::conversion_matches_exact_scaled_rationals175 [ 00:00:00] horae-core format_cents_plain_keeps_sign_below_one_unit176 [ 00:00:00] horae-core rse_cents_is_exact_where_a_float_would_drift177 [ 00:00:00] horae-core rse_cents_reads_whole_and_fractional_amounts178 [ 00:00:00] horae-core se_cents_tolerates_grouping_spaces_and_signs179 [ 00:00:00] horae-core al_scope_even_when_both_domains_are_readable180 [ 00:00:00] horae-core atalog_grants_cannot_substitute_for_approval181 Running [ 00:00:00] =====> 115/189: 8 running, 83 passed, 0 skipped 182 [ 00:00:00] horae-core s::conversion_matches_exact_scaled_rationals183 [ 00:00:00] horae-core format_cents_plain_keeps_sign_below_one_unit184 [ 00:00:00] horae-core rse_cents_is_exact_where_a_float_would_drift185 [ 00:00:00] horae-core rse_cents_reads_whole_and_fractional_amounts186 [ 00:00:00] horae-core se_cents_tolerates_grouping_spaces_and_signs187 [ 00:00:00] horae-core al_scope_even_when_both_domains_are_readable188 [ 00:00:00] horae-core atalog_grants_cannot_substitute_for_approval189 PASS [ 0.106s] horae-core importers::harvest::convert::tests::conversion_matches_exact_scaled_rationals190 PASS [ 0.009s] horae-core money::tests::parse_cents_tolerates_grouping_spaces_and_signs191 PASS [ 0.007s] horae-core permissions::approvals::tests::expense_read_scope_and_approval_scope_form_an_intersection192 PASS [ 0.021s] horae-core money::tests::parse_cents_reads_whole_and_fractional_amounts193 PASS [ 0.022s] horae-core money::tests::format_cents_plain_keeps_sign_below_one_unit194 PASS [ 0.013s] horae-core permissions::approvals::tests::all_records_need_approval_scope_even_when_both_domains_are_readable195 PASS [ 0.011s] horae-core permissions::approvals::tests::empty_record_sets_do_not_remove_identity_or_explicit_grant_checks196 PASS [ 0.011s] horae-core permissions::approvals::tests::catalog_grants_cannot_substitute_for_approval197 PASS [ 0.027s] horae-core money::tests::parse_cents_is_exact_where_a_float_would_drift198 PASS [ 0.016s] horae-core permissions::approvals::tests::inactive_and_foreign_provenance_deny_even_with_all_grants199 PASS [ 0.009s] horae-core permissions::approvals::tests::only_expense_reads_or_their_write_prerequisites_make_others_expenses_visible200 PASS [ 0.010s] horae-core permissions::approvals::tests::removing_the_last_matching_relationship_revokes_both_domains201 PASS [ 0.010s] horae-core permissions::approvals::tests::one_unreadable_expense_denies_the_whole_supplied_set202 PASS [ 0.013s] horae-core permissions::approvals::tests::reevaluation_does_not_reuse_prior_read_or_approval_success203 PASS [ 0.013s] horae-core permissions::approvals::tests::no_expense_read_is_needed_when_there_are_no_expenses204 PASS [ 0.004s] horae-core permissions::catalog::stored_tests::rejects_each_missing_floor_grant205 PASS [ 0.014s] horae-core permissions::approvals::tests::missing_dimensions_and_input_duplicates_do_not_infer_scope206 PASS [ 0.009s] horae-core permissions::catalog::stored_tests::rejects_duplicate_grants_instead_of_silently_deduplicating207 PASS [ 0.009s] horae-core permissions::catalog::stored_tests::rejects_empty_saved_selection_instead_of_adding_member_floor208 PASS [ 0.007s] horae-core permissions::catalog::stored_tests::stored_order_does_not_change_the_selected_set209 PASS [ 0.011s] horae-core permissions::catalog::stored_tests::rejects_unsupported_versions_even_for_valid_grants210 PASS [ 0.011s] horae-core permissions::catalog::stored_tests::restores_custom_selection_without_reapplying_profile_defaults211 PASS [ 0.005s] horae-core permissions::catalog::tests::approve_all_includes_read_scopes_but_not_write_or_expense_management212 Running [ 00:00:00] ====> 117/189: 8 running, 117 passed, 0 skipped 213 [ 00:00:00] horae-core h_valid_grant_pair_and_its_revoked_selection214 [ 00:00:00] horae-core ludes_floor_and_is_closed_under_dependencies215 [ 00:00:00] horae-core _and_project_manager_has_no_financial_grants216 [ 00:00:00] horae-core loor_cannot_be_removed_or_partially_modified217 [ 00:00:00] horae-core mpotent_order_independent_and_duplicate_free218 [ 00:00:00] horae-core _reject_legacy_rank_names_and_unknown_values219 [ 00:00:00] horae-core ing_absent_permission_is_an_idempotent_no_op220 PASS [ 0.016s] horae-core permissions::catalog::stored_tests::rejects_every_missing_prerequisite_without_repairing_input221 PASS [ 0.007s] horae-core permissions::catalog::tests::catalog_has_fifty_distinct_known_grants222 PASS [ 0.011s] horae-core permissions::catalog::tests::administrator_selection_covers_known_catalog_without_unknown_ids223 PASS [ 0.017s] horae-core permissions::catalog::stored_tests::restores_each_builtin_selection_without_changing_grants224 PASS [ 0.016s] horae-core permissions::catalog::tests::adding_all_catalog_grants_produces_exactly_the_catalog225 PASS [ 0.006s] horae-core permissions::catalog::tests::direct_profile_defaults_match_the_known_reference_catalog226 PASS [ 0.006s] horae-core permissions::catalog::tests::empty_selection_includes_member_floor227 PASS [ 0.006s] horae-core permissions::catalog::tests::every_declared_dependency_is_added_and_removing_it_removes_the_dependent228 PASS [ 0.011s] horae-core permissions::catalog::tests::dependency_graph_matches_the_reference_edges_without_extra_cross_resource_grants229 PASS [ 0.009s] horae-core permissions::catalog::tests::known_permission_name_decodes_without_legacy_role_conversion230 PASS [ 0.008s] horae-core permissions::catalog::tests::member_has_only_own_time_and_expense_access231 Running [ 00:00:00] ====> 117/189: 8 running, 117 passed, 0 skipped 232 [ 00:00:00] horae-core h_valid_grant_pair_and_its_revoked_selection233 [ 00:00:00] horae-core ludes_floor_and_is_closed_under_dependencies234 [ 00:00:00] horae-core _and_project_manager_has_no_financial_grants235 [ 00:00:00] horae-core loor_cannot_be_removed_or_partially_modified236 [ 00:00:00] horae-core mpotent_order_independent_and_duplicate_free237 [ 00:00:00] horae-core _reject_legacy_rank_names_and_unknown_values238 [ 00:00:00] horae-core ing_absent_permission_is_an_idempotent_no_op239 Running [ 00:00:00] =====> 139/189: 8 running, 139 passed, 0 skipped 240 [ 00:00:00] horae-core h_valid_grant_pair_and_its_revoked_selection241 [ 00:00:00] horae-core mpotent_order_independent_and_duplicate_free242 [ 00:00:00] horae-core er_never_uses_the_other_management_dimension243 [ 00:00:00] horae-core re_independent_and_read_does_not_allow_write244 [ 00:00:00] horae-core equire_write_even_for_zero_or_an_equal_value245 [ 00:00:00] horae-core ies_without_mutating_the_remaining_selection246 [ 00:00:00] horae-core nt_mismatches_deny_even_all_financial_grants247 PASS [ 0.011s] horae-core permissions::catalog::tests::finance_profiles_cannot_edit_rates_and_project_manager_has_no_financial_grants248 PASS [ 0.007s] horae-core permissions::catalog::tests::profiles_reject_legacy_rank_names_and_unknown_values249 PASS [ 0.016s] horae-core permissions::catalog::tests::every_profile_includes_floor_and_is_closed_under_dependencies250 PASS [ 0.007s] horae-core permissions::catalog::tests::removing_absent_permission_is_an_idempotent_no_op251 PASS [ 0.020s] horae-core permissions::catalog::tests::floor_cannot_be_removed_or_partially_modified252 PASS [ 0.011s] horae-core permissions::catalog::tests::removing_managed_time_read_also_removes_all_reads_writes_and_approvals253 PASS [ 0.013s] horae-core permissions::catalog::tests::removing_invoice_draft_write_keeps_read_but_removes_managed_and_all_write254 PASS [ 0.011s] horae-core permissions::catalog::tests::removing_one_financial_permission_preserves_unrelated_families255 PASS [ 0.018s] horae-core permissions::catalog::tests::removing_any_non_floor_grant_keeps_the_remaining_selection_closed256 PASS [ 0.011s] horae-core permissions::catalog::tests::report_and_withdrawal_grants_do_not_add_unrelated_authority257 PASS [ 0.011s] horae-core permissions::catalog::tests::template_names_reject_empty_and_overlong_unicode_names258 PASS [ 0.012s] horae-core permissions::catalog::tests::unknown_permission_names_are_rejected259 PASS [ 0.012s] horae-core permissions::catalog::tests::template_names_trim_without_changing_display_or_internal_spaces260 PASS [ 0.012s] horae-core permissions::person_management::tests::combined_unrelated_grants_do_not_create_person_management_eligibility261 PASS [ 0.012s] horae-core permissions::person_management::tests::each_catalog_grant_has_the_specified_compatibility_without_changing_grants262 PASS [ 0.009s] horae-core permissions::person_management::tests::eligibility_tracks_last_compatible_grant_loss_and_restoration263 PASS [ 0.012s] horae-core permissions::person_management::tests::other_people_and_empty_removal_need_neither_grants_nor_a_separate_actor264 PASS [ 0.007s] horae-core permissions::rates::tests::billable_actions_use_only_their_own_grant_and_owner_scope265 PASS [ 0.011s] horae-core permissions::person_management::tests::self_link_rejects_the_proposal_in_every_position_without_filtering_it266 PASS [ 0.027s] horae-core permissions::person_management::tests::any_compatible_grant_suffices_in_every_pair267 PASS [ 0.014s] horae-core permissions::person_management::tests::own_tracking_floor_does_not_qualify268 PASS [ 0.015s] horae-core permissions::rates::tests::all_six_defaults_have_the_approved_financial_access269 Running [ 00:00:00] =====> 139/189: 8 running, 139 passed, 0 skipped 270 [ 00:00:00] horae-core h_valid_grant_pair_and_its_revoked_selection271 [ 00:00:00] horae-core mpotent_order_independent_and_duplicate_free272 [ 00:00:00] horae-core er_never_uses_the_other_management_dimension273 [ 00:00:00] horae-core re_independent_and_read_does_not_allow_write274 [ 00:00:00] horae-core equire_write_even_for_zero_or_an_equal_value275 [ 00:00:00] horae-core ies_without_mutating_the_remaining_selection276 [ 00:00:00] horae-core nt_mismatches_deny_even_all_financial_grants277 Running [ 00:00:00] =======> 167/189: 8 running, 167 passed, 0 skipped 278 [ 00:00:00] horae-core e_rejects_invalid_precision_range_and_syntax279 [ 00:00:00] horae-core inutes_respect_frozen_history_including_zero280 [ 00:00:00] horae-core rounding::tests::identity_when_inc_zero281 [ 00:00:00] horae-core rounding::tests::nearest_ties_round_up282 [ 00:00:00] horae-core state::tests::invoiced_is_final283 [ 00:00:00] horae-core rounding::tests::up_and_down284 [ 00:00:00] horae-core rounding::tests::result_is_multiple_of_inc285 PASS [ 0.019s] horae-core permissions::rates::tests::billable_owner_never_uses_the_other_management_dimension286 PASS [ 0.016s] horae-core permissions::rates::tests::explicit_rate_edits_require_write_even_for_zero_or_an_equal_value287 PASS [ 0.020s] horae-core permissions::rates::tests::cost_and_billable_grants_are_independent_and_read_does_not_allow_write288 PASS [ 0.016s] horae-core permissions::rates::tests::read_only_cost_grant_cannot_authorize_an_explicit_rate_edit289 PASS [ 0.018s] horae-core permissions::rates::tests::identity_and_tenant_mismatches_deny_even_all_financial_grants290 PASS [ 0.019s] horae-core permissions::rates::tests::grant_removal_denies_without_mutating_the_remaining_selection291 PASS [ 0.092s] horae-core permissions::catalog::stored_tests::restores_each_valid_grant_pair_and_its_revoked_selection292 PASS [ 0.009s] horae-core permissions::rates::tests::removing_read_prerequisites_denies_both_actions293 PASS [ 0.006s] horae-core permissions::tests::assignment_matching_searches_all_members_and_is_insensitive_to_duplicates294 PASS [ 0.012s] horae-core permissions::rates::tests::unchanged_rate_edit_requires_no_financial_write_grant295 PASS [ 0.012s] horae-core permissions::rates::tests::unrelated_catalog_grants_never_authorize_ordinary_financial_fields296 PASS [ 0.010s] horae-core permissions::tests::assignments_do_not_grant_scope_and_missing_assignments_do_not_match297 PASS [ 0.010s] horae-core permissions::tests::every_scope_combination_matches_only_explicitly_granted_dimensions298 PASS [ 0.010s] horae-core permissions::tests::inactive_or_foreign_context_is_denied_for_every_scope_combination299 PASS [ 0.005s] horae-core project::tests::basics_reject_overlong_code_and_unsupported_currency300 PASS [ 0.007s] horae-core project::tests::basics_reject_blank_and_overlong_names301 PASS [ 0.014s] horae-core project::tests::basics_accept_supported_currencies_and_optional_dates302 PASS [ 0.090s] horae-core permissions::catalog::tests::normalization_is_idempotent_order_independent_and_duplicate_free303 PASS [ 0.007s] horae-core permissions::tests::removing_an_assignment_removes_only_that_matching_dimension304 PASS [ 0.015s] horae-core project::tests::basics_accept_same_day_but_reject_reversed_dates305 PASS [ 0.019s] horae-core permissions::tests::scope_union_obeys_set_laws306 PASS [ 0.014s] horae-core project::tests::fee_schedules_reject_missing_overlong_and_excessive_milestones307 PASS [ 0.009s] horae-core project::tests::monthly_fee_dates_reject_invalid_calendar_inputs308 PASS [ 0.013s] horae-core project::tests::monthly_fee_dates_follow_calendar_months309 Running [ 00:00:00] =======> 167/189: 8 running, 167 passed, 0 skipped 310 [ 00:00:00] horae-core e_rejects_invalid_precision_range_and_syntax311 [ 00:00:00] horae-core inutes_respect_frozen_history_including_zero312 [ 00:00:00] horae-core rounding::tests::identity_when_inc_zero313 [ 00:00:00] horae-core rounding::tests::nearest_ties_round_up314 [ 00:00:00] horae-core state::tests::invoiced_is_final315 [ 00:00:00] horae-core rounding::tests::up_and_down316 [ 00:00:00] horae-core rounding::tests::result_is_multiple_of_inc317 PASS [ 0.018s] horae-core project::tests::monetary_budgets_are_only_available_for_time_and_materials318 PASS [ 0.013s] horae-core project::tests::payment_terms_support_receipt_and_checked_days319 PASS [ 0.020s] horae-core project::tests::fee_schedules_validate_amounts_and_milestone_total320 PASS [ 0.014s] horae-core project::tests::percentage_preserves_exact_hundredths321 Running [ 00:00:00] =======> 167/189: 8 running, 167 passed, 0 skipped 322 [ 00:00:00] horae-core e_rejects_invalid_precision_range_and_syntax323 [ 00:00:00] horae-core inutes_respect_frozen_history_including_zero324 [ 00:00:00] horae-core rounding::tests::identity_when_inc_zero325 [ 00:00:00] horae-core rounding::tests::nearest_ties_round_up326 [ 00:00:00] horae-core state::tests::invoiced_is_final327 [ 00:00:00] horae-core rounding::tests::up_and_down328 [ 00:00:00] horae-core rounding::tests::result_is_multiple_of_inc329 PASS [ 0.010s] horae-core rounding::tests::identity_when_inc_zero330 PASS [ 0.019s] horae-core rounding::tests::effective_minutes_respect_frozen_history_including_zero331 PASS [ 0.012s] horae-core rounding::tests::up_and_down332 PASS [ 0.021s] horae-core project::tests::percentage_rejects_invalid_precision_range_and_syntax333 PASS [ 0.019s] horae-core rounding::tests::nearest_ties_round_up334 PASS [ 0.019s] horae-core rounding::tests::result_is_multiple_of_inc335 PASS [ 0.014s] horae-core state::tests::member_submit_and_reopen336 PASS [ 0.021s] horae-core state::tests::invoiced_is_final337 PASS [ 0.023s] horae-core state::tests::managers_invoice_open_and_approved_time338 PASS [ 0.019s] horae-core time_of_day::tests::clamp_to_day_prevents_crossing_midnight339 PASS [ 0.020s] horae-core state::tests::only_manager_can_approve340 PASS [ 0.020s] horae-core time_of_day::tests::format_12h_matches_harvest_style341 PASS [ 0.016s] horae-core time_of_day::tests::parse_reads_12h_including_edges342 PASS [ 0.017s] horae-core time_of_day::tests::format_round_trips343 PASS [ 0.006s] horae-core types::tests::budget_kind_wire_strings_match_db_enum344 PASS [ 0.017s] horae-core time_of_day::tests::parse_reads_24h345 PASS [ 0.008s] horae-core week::tests::maps_any_weekday_to_its_monday346 PASS [ 0.023s] horae-core time_of_day::tests::parse_rejects_out_of_range_and_garbage347 PASS [ 0.012s] horae-core week::tests::configured_week_contains_each_day_for_all_seven_start_days348 PASS [ 0.013s] horae-core week::tests::configured_week_can_start_in_the_previous_year349 PASS [ 0.024s] horae-core time_of_day::tests::snap_rounds_to_nearest_step350 PASS [ 0.014s] horae-core week::tests::configured_week_reports_an_unrepresentable_start351------------352 Summary [ 0.347s] 189 tests run: 189 passed, 0 skipped353 Running [ 00:00:00] ======== 189/189: 8 running, 167 passed, 0 skipped 354 [ 00:00:00] horae-core e_rejects_invalid_precision_range_and_syntax355 [ 00:00:00] horae-core inutes_respect_frozen_history_including_zero356 [ 00:00:00] horae-core rounding::tests::identity_when_inc_zero357 [ 00:00:00] horae-core rounding::tests::nearest_ties_round_up358 [ 00:00:00] horae-core state::tests::invoiced_is_final359 [ 00:00:00] horae-core rounding::tests::up_and_down360 [ 00:00:00] horae-core rounding::tests::result_is_multiple_of_inc361The files belonging to this database system will be owned by user "nixbld".362This user must also own the server process.363364The database cluster will be initialized with locale "C".365The default text search configuration will be set to "english".366367Data page checksums are disabled.368369fixing permissions on existing directory /build/tmp.qpE9EixTa9 ... ok370creating subdirectories ... ok371selecting dynamic shared memory implementation ... posix372selecting default "max_connections" ... 100373selecting default "shared_buffers" ... 128MB374selecting default time zone ... UTC375creating configuration files ... ok376running bootstrap script ... ok377performing post-bootstrap initialization ... ok378syncing data to disk ... ok379380initdb: warning: enabling "trust" authentication for local connections381initdb: hint: You can change this by editing pg_hba.conf or using the option -A, or --auth-local and --auth-host, the next time you run initdb.382383Success. You can now start the database server using:384385 pg_ctl -D /build/tmp.qpE9EixTa9 -l logfile start386387waiting for server to start.... done388server started389+++ command cargo test -p horae --features server390 Compiling horae v0.1.0 (/build/source/crates/horae)391 Compiling horae-core v0.1.0 (/build/source/crates/core)392 Finished `test` profile [unoptimized + debuginfo] target(s) in 9m 56s393 Running unittests src/main.rs (target/debug/deps/horae-28e72b71798c6b17)394395running 1043 tests396test auth::oidc::tests::first_login_links_subject_via_verified_email ... ok397test auth::oidc::tests::extra_audiences_are_trusted_only_when_listed ... ok398test auth::oidc::tests::deactivated_subject_match_is_denied ... ok399test auth::oidc::tests::deactivated_email_match_is_denied ... ok400test auth::oidc::tests::no_account_is_denied_not_provisioned ... ok401test auth::oidc::tests::subject_match_logs_in_without_relinking ... ok402test auth::oidc::tests::subject_match_takes_precedence_over_email ... ok403test auth::oidc::tests::unverified_email_is_not_matched ... ok404test auth::page::tests::configured_label_is_html_escaped ... ok405test auth::page::tests::dev_variant_offers_the_admin_bypass_and_no_fake_controls ... ok406test auth::page::tests::oidc_variant_uses_the_configured_label_and_hands_off_to_start ... ok407test cli::imports::tests::cancellation_racing_completion_does_not_claim_cancellation_was_requested ... ok408test cli::imports::tests::api_submission_captures_generation_without_retrying_uncertain_acceptance ... ok409test cli::imports::tests::csv_named_pipe_is_rejected_without_waiting_for_a_writer ... ok410test cli::imports::tests::invalid_csv_files_fail_before_contacting_the_server ... ok411test cli::imports::tests::malformed_submission_acknowledgement_retains_its_request_identity ... ok412test cli::imports::tests::missing_session_is_a_structured_configuration_failure ... ok413test cli::imports::tests::missing_and_mismatched_jobs_fail_without_substitution ... ok414test cli::imports::tests::private_session_accepts_https_and_loopback_only ... ok415test cli::imports::tests::redirects_are_not_followed_or_exposed_as_server_error_text ... ok416test cli::imports::tests::report_marks_confirmed_failed_outcomes_as_incomplete ... ok417test cli::imports::tests::archived_errors_publish_without_clobbering_and_preserve_the_prior_file_on_failure ... ok418test cli::imports::tests::retry_snapshot_is_compatible_with_missing_and_future_values ... ok419test cli::imports::tests::session_rejects_cookie_header_injection_without_echoing_the_value ... ok420test cli::imports::tests::session_rejects_plaintext_remote_and_credential_bearing_urls ... ok421test cli::imports::tests::session_rejects_public_permissions_and_symlinks ... ok422test cli::imports::tests::ordinary_json_is_bounded_and_invalid_replies_are_not_echoed ... ok423test cli::imports::tests::status_and_wait_distinguish_failed_jobs_from_failed_reads ... ok424test cli::tests::default_command_rejects_invalid_environment_ports ... ok425test cli::tests::environment_probe ... ok426test cli::tests::remote_commands_reject_conflicting_or_unbounded_options ... ok427test cli::tests::default_command_uses_the_same_defaults_and_environment_as_serve ... ok428test cli::tests::remote_import_and_job_commands_accept_the_documented_arguments ... ok429test config::tests::dev_login_is_allowed_on_loopback ... ok430test components::permission_description::tests::permission_descriptions_cover_each_grant_distinctly ... ok431test config::tests::dev_login_is_refused_off_loopback ... ok432test config::tests::environment::environment_probe ... ok433test config::tests::environment::empty_environment_has_no_authentication_or_plugin_credentials ... ok434test config::tests::environment::example_environment_can_configure_all_required_oidc_and_harvest_fields ... ok435test config::tests::environment::job_attempt_limit_uses_the_documented_environment_variable ... ok436test config::tests::environment::invalid_job_attempt_limits_reject_startup ... ok437test config::tests::environment::mail_environment_requires_a_complete_valid_configuration ... ok438test config::tests::environment::obsolete_authentication_variables_do_not_configure_the_server ... ok439test config::tests::environment::partial_oidc_configuration_remains_disabled_without_a_callback ... ok440test config::tests::without_dev_login_any_bind_is_fine ... ok441test db::tests::pool_connections_force_custom_plans ... ok442test config::tests::environment::secure_cookies_use_the_documented_prefixed_variable ... ok443test auth::oidc::tests::linking::different_subjects_cannot_both_claim_an_unlinked_account ... ok444test auth::oidc::tests::linking::unverified_email_cannot_link_an_account ... ok445test auth::oidc::tests::linking::deactivation_during_first_link_denies_login ... ok446test auth::oidc::tests::linking::simultaneous_logins_with_the_same_subject_are_allowed ... ok447test auth::oidc::tests::linking::existing_subject_wins_over_another_accounts_email ... ok448test harvest::pagination_tests::harvest_own_time_omits_private_project_budget_metadata ... ok449test db::tests::reset_empties_the_database_and_reapplies_migrations ... ok450test harvest::pagination_tests::harvest_pagination_total_pages_does_not_overflow ... ok451test cli::imports::tests::wait_deadline_caps_a_pending_request_without_cancelling_the_job ... ok452test harvest::pagination_tests::harvest_pagination_time_entries_keep_the_filtered_set_and_date_ties ... ok453test harvest::pagination_tests::harvest_pagination_empty_and_out_of_range_pages_keep_the_contract ... ok454test harvest::tests::a_manager_lists_users_with_their_rates ... ok455test harvest::pagination_tests::harvest_task_access_filters_counts_and_preserves_rate_free_history ... ok456test harvest::tests::a_manager_sees_the_whole_org ... ok457test harvest::tests::a_member_cannot_fetch_a_colleagues_entry ... ok458test harvest::tests::a_member_cannot_filter_to_a_colleague ... ok459test harvest::pagination_tests::harvest_pagination_malformed_filters_are_client_errors ... ok460test harvest::tests::a_member_cannot_list_users ... ok461test harvest::tests::a_member_sees_only_their_own_time_entries ... ok462test harvest::pagination_tests::harvest_pagination_catalog_links_preserve_filters_and_break_name_ties ... ok463test harvest::tests::harvest_effective_minutes_match_sql_for_open_and_frozen_time ... ok464test harvest::tests::harvest_entry_rates_respect_selected_project_mode ... ok465test harvest::pagination_tests::harvest_pagination_rejects_invalid_windows_on_every_collection ... ok466test harvest::tests::page_window_defaults_and_checked_offsets ... ok467test harvest::tests::harvest_entry_rates_follow_the_cascade_and_frozen_invoice_line ... ok468test harvest::tests::harvest_marks_unbilled_non_billable_contexts_consistently ... ok469test harvest::tests::members_cannot_read_own_project_rates_or_cost_overrides ... ok470test importers::harvest::account_switch::tests::a_b_a_keeps_old_callbacks_requests_and_retries_fenced ... ok471test importers::harvest::account_switch::tests::change_preserves_terminal_history_and_rejects_stale_confirmation ... ok472test harvest::pagination_tests::harvest_project_progress_permissions_cover_counts_pages_and_details ... ok473test importers::harvest::account_switch::tests::competing_change_and_submission_cannot_both_succeed ... ok474test importers::harvest::account_switch::tests::competing_callbacks_and_confirmations_have_one_winner ... ok475test importers::harvest::account_switch::tests::queue_acceptance_does_not_wait_for_the_import_session_lock ... ok476test importers::harvest::account_switch::tests::disconnect_and_reconnect_fence_callbacks_but_not_same_account_work ... ok477test importers::harvest::api_source::http::tests::cancelled_backoff_does_not_wait_or_retry ... ok478test importers::harvest::api_source::http::tests::cursor_links_are_authoritative_even_with_null_or_stale_page_numbers ... ok479test importers::harvest::api_source::http::tests::http_pages_follow_cursor_and_preserve_headers_and_encoded_filter ... ok480test importers::harvest::account_switch::tests::queued_work_and_provenance_block_without_changing_binding ... ok481test importers::harvest::api_source::http::tests::http_retries_429_but_never_follows_redirects_or_shortens_long_backoff ... ok482test importers::harvest::api_source::http::tests::missing_next_cursor_is_not_silently_treated_as_completed ... ok483test importers::harvest::api_source::http::tests::pagination_cycle_detection_survives_restarting_after_every_page ... ok484test importers::harvest::api_source::http::tests::persisted_cursor_resumes_with_a_new_client_and_stays_complete_at_eof ... ok485test importers::harvest::api_source::http::tests::rejected_page_does_not_advance_the_cursor ... ok486test importers::harvest::api_source::http::tests::rejects_pagination_outside_the_authenticated_endpoint ... ok487test importers::harvest::api_source::http::tests::resumed_cursor_rejects_untrusted_destinations_and_invalid_state_before_http ... ok488test importers::harvest::account_switch::tests::successful_change_preserves_business_rows_and_failure_rolls_back_secrets ... ok489test importers::harvest::api_source::tests::assembled_rows_convert_to_exact_minutes ... ok490test importers::harvest::api_source::tests::assembles_rows_joining_parents_by_id ... ok491test importers::harvest::api_source::tests::hours_render_as_exact_decimals ... ok492test importers::harvest::api_source::tests::http_page_preserves_decimal_values_before_integer_conversion ... ok493test importers::harvest::api_source::tests::json_exponents_expand_exactly_with_bounded_output ... ok494test harvest::pagination_tests::harvest_project_cost_overrides_require_admin_without_fabricated_fallback ... ok495test importers::harvest::credentials::tests::bad_key_length_is_rejected ... ok496test importers::harvest::account_switch::tests::retry_and_change_are_serialized ... ok497test importers::harvest::account_switch::tests::running_jobs_block_change_and_old_execution_never_reaches_http ... ok498test importers::harvest::api_source::http::tests::http_rejects_oversized_malformed_and_cyclic_pages ... ok499test importers::harvest::api_source::http::tests::slow_consumer_backpressures_http_and_cancellation_stops_further_pages ... ok500test importers::harvest::credentials::tests::decode_hex_rejects_bad_input ... ok501test importers::harvest::credentials::tests::another_account_cannot_replace_credentials_or_watermarks ... ok502test importers::harvest::credentials::tests::encrypt_then_decrypt_round_trips ... ok503test importers::harvest::credentials::tests::connection_changes_work_with_a_single_connection_pool ... ok504test importers::harvest::credentials::tests::concurrent_first_connections_cannot_bind_different_accounts ... ok505test importers::harvest::credentials::tests::nonce_makes_ciphertext_nondeterministic ... ok506test importers::harvest::credentials::tests::connect_and_disconnect_share_import_exclusion_without_blocking_other_orgs ... ok507test importers::harvest::credentials::tests::disconnect_preserves_identity_and_provenance_for_the_original_account ... ok508test importers::harvest::credentials::tests::wrong_key_fails_to_decrypt ... ok509test importers::harvest::csv_source::tests::bad_date_becomes_a_row_error_not_a_rejection ... ok510test importers::harvest::csv_source::tests::conflicting_email_aliases_error_only_the_affected_row ... ok511test importers::harvest::csv_source::tests::csv_records_preserve_multiline_unicode_across_single_byte_reads ... ok512test importers::harvest::csv_source::tests::cursor_beyond_upload_is_rejected_without_parsing_rows ... ok513test importers::harvest::csv_source::tests::cursor_resumes_after_multiline_unicode_and_preserves_error_locations ... ok514test importers::harvest::csv_source::tests::delivers_a_row_before_reading_the_rest_of_the_file ... ok515test importers::harvest::csv_source::tests::empty_file_is_rejected ... ok516test importers::harvest::csv_source::tests::identity_columns_are_required_and_cannot_repeat ... ok517test importers::harvest::csv_source::tests::invalid_utf8_errors_one_record_and_continues ... ok518test importers::harvest::csv_source::tests::missing_required_columns_is_rejected ... ok519test importers::harvest::csv_source::tests::names_stay_separate_from_optional_email ... ok520test importers::harvest::csv_source::tests::parse_bool_accepts_yes_variants ... ok521test importers::harvest::csv_source::tests::parses_rows_case_insensitively ... ok522test importers::harvest::credentials::tests::same_account_reconnect_rotates_encryption_without_resetting_watermarks ... ok523test importers::harvest::credentials::tests::migration_binds_existing_connections_without_changing_secrets_or_markers ... ok524test importers::harvest::credentials::tests::failed_credential_write_does_not_leave_an_account_binding ... ok525test importers::harvest::credentials::tests::unidentified_legacy_provenance_requires_operator_review ... ok526test importers::harvest::engine_tests::api_and_csv_share_the_lock_but_other_organizations_can_import ... ok527test harvest::tests::imported_legacy_rates_survive_retry_in_harvest_list_and_detail ... ok528test importers::harvest::engine_tests::api_connection_checks_work_with_a_single_connection_pool ... ok529test importers::harvest::engine_tests::api_sync_adopts_entries_from_a_prior_csv_import ... ok530test importers::harvest::engine_tests::bad_records_are_reported_and_run_continues ... ok531test importers::harvest::engine_tests::cancelled_http_waiter_keeps_the_lock_until_its_worker_exits ... ok532test importers::harvest::engine_tests::cancellation_rolls_back_rows_and_releases_the_import_session ... ok533test harvest::pagination_tests::harvest_pagination_router_preserves_session_and_tenant_guards ... ok534test importers::harvest::engine_tests::csv_ambiguous_names_include_inactive_users_but_unique_email_disambiguates ... ok535test importers::harvest::engine_tests::concurrent_imports_reject_overlap_without_collapsing_repeated_entries ... ok536test importers::harvest::engine_tests::csv_import_populates_and_is_idempotent ... ok537test importers::harvest::engine_tests::csv_malformed_file_is_rejected_with_no_writes ... ok538test importers::harvest::engine_tests::csv_name_fallback_requires_a_full_unique_name_and_never_overrides_email ... ok539test importers::harvest::credentials::tests::completed_credential_changes_allow_immediate_retries ... ok540test importers::harvest::engine_tests::csv_name_only_matches_one_org_user_and_reimports_without_duplicates ... ok541test importers::harvest::engine_tests::csv_name_only_dry_run_and_duplicate_occurrences_preserve_history ... ok542test importers::harvest::engine_tests::csv_streaming::cancelling_a_csv_waiting_for_more_bytes_releases_its_session ... ok543test importers::harvest::engine_tests::csv_streaming::csv_applies_before_eof_but_transport_failure_rolls_back_everything ... ok544test importers::harvest::engine_tests::csv_streaming::csv_preview_errors_and_repeated_rows_match_commit_and_reimport ... ok545test importers::harvest::engine_tests::completed_imports_allow_immediate_retries ... ok546test importers::harvest::engine_tests::csv_streaming::durable_csv_preview_crosses_batch_boundaries_without_committing_domain_data ... ok547test importers::harvest::engine_tests::csv_streaming::csv_sql_backpressure_stops_reading_later_input_rows ... ok548test importers::harvest::engine_tests::csv_streaming::durable_csv_cancel_joins_parser_and_preserves_committed_rows ... ok549test importers::harvest::engine_tests::csv_streaming::durable_csv_preview_cancel_preserves_simulation_for_manual_retry ... ok550test importers::harvest::engine_tests::csv_streaming::durable_csv_preview_rejects_a_stale_next_batch ... ok551test importers::harvest::engine_tests::csv_streaming::durable_csv_report_metadata_is_bounded_after_recovery ... ok552test importers::harvest::engine_tests::csv_streaming::measure_csv_durable_100k ... ignored, 100,000-row durable CSV measurement; run explicitly with --release --nocapture553test importers::harvest::engine_tests::csv_streaming::measure_csv_durable_large_catalog_100k ... ignored, 100,000-row durable CSV with 5,000 parent sets; run explicitly with --release --nocapture554test importers::harvest::engine_tests::csv_streaming::measure_csv_streaming_100k ... ignored, 100,000-row CSV measurement; run explicitly with --release --nocapture555test importers::harvest::engine_tests::csv_streaming::measure_csv_streaming_large_catalog_100k ... ignored, 100,000-row CSV with 5,000 parent sets; run explicitly with --release --nocapture556test importers::harvest::engine_tests::csv_streaming::durable_csv_cancel_preserves_its_completed_batches_for_manual_retry ... ok557test importers::harvest::engine_tests::csv_streaming::durable_csv_stale_commit_is_fenced_without_a_heartbeat ... ok558test importers::harvest::engine_tests::edited_entry_still_matched_by_provenance ... ok559test importers::harvest::engine_tests::distinct_harvest_ids_with_identical_fields_import_as_two ... ok560test importers::harvest::engine_tests::dry_run_writes_nothing_and_matches_commit ... ok561test importers::harvest::engine_tests::csv_streaming::durable_csv_preview_resumes_after_a_crash_without_recounting_rows ... ok562test importers::harvest::engine_tests::full_import_creates_all_levels_with_exact_minutes ... ok563test importers::harvest::engine_tests::import_rejects_ambiguous_normalized_email_without_partial_writes ... ok564test importers::harvest::engine_tests::failed_source_releases_the_session_and_rolls_back_partial_rows ... ok565test importers::harvest::engine_tests::lookup_cache::cold_query_callsite_on_untraced_thread_is_still_captured ... ok566test importers::harvest::engine_tests::lookup_cache::cached_project_task_still_validates_each_rows_rate ... ok567test importers::harvest::engine_tests::lookup_cache::cached_email_and_full_name_do_not_share_a_namespace ... ok568test importers::harvest::engine_tests::lookup_cache::lookup_index_migration_preserves_existing_ambiguous_identities ... ok569test importers::harvest::engine_tests::csv_streaming::durable_csv_resumes_committed_batches_without_recounting_duplicate_rows ... ok570test importers::harvest::engine_tests::lookup_cache::new_run_rechecks_previously_cached_user_for_ambiguity ... ok571test importers::harvest::engine_tests::csv_streaming::durable_csv_reclaimed_lease_cannot_commit_the_next_batch ... ok572test importers::harvest::engine_tests::lookup_cache::project_task_cache_distinguishes_both_sides_of_the_link ... ok573test importers::harvest::engine_tests::lookup_cache::rolled_back_row_does_not_cache_user_or_project_task ... ok574test importers::harvest::engine_tests::natural_key_reimport_normalizes_whitespace_and_ascii_case ... ok575test importers::harvest::engine_tests::overflowing_decimals_fail_only_their_rows ... ok576test importers::harvest::engine_tests::reimporting_identical_csv_rows_is_idempotent ... ok577test importers::harvest::engine_tests::second_identical_run_creates_nothing ... ok578test importers::harvest::oauth::tests::authorize_url_carries_state_and_encoded_redirect ... ok579test importers::harvest::oauth::tests::authorize_url_preserves_query_values_without_injecting_parameters ... ok580test importers::harvest::oauth_callback_tests::account_policy_failures_return_safe_actionable_conflicts ... ok581test importers::harvest::oauth_callback_tests::mismatched_state_is_rejected_without_a_code ... ok582test importers::harvest::oauth_callback_tests::missing_returned_state_is_rejected ... ok583test importers::harvest::oauth_callback_tests::missing_stored_state_is_rejected ... ok584test importers::harvest::oauth_callback_tests::provider_error_is_rejected_before_exchange ... ok585test importers::harvest::oauth_callback_tests::valid_matching_state_yields_the_code ... ok586test importers::harvest::oauth_callback_tests::valid_state_but_missing_code_is_rejected ... ok587test importers::harvest::report::tests::archive_metadata_cannot_masquerade_as_a_legacy_or_inconsistent_report ... ok588test importers::harvest::report::tests::archived_report_round_trips_without_losing_error_accounting ... ok589test importers::harvest::report::tests::legacy_report_preserves_its_counts_and_error_details ... ok590test importers::harvest::report::tests::report_rejects_unsupported_and_invalid_versions ... ok591test importers::harvest::report::tests::serialized_report_has_a_supported_schema_version ... ok592test importers::harvest::resolve::checkpoint_tests::run_cache_round_trip_preserves_identity_namespaces_and_occurrences ... ok593test importers::harvest::engine_tests::watermark_advances_only_on_commit ... ok594test importers::harvest::engine_tests::submission_barrier_blocks_imported_time_entries ... ok595test importers::harvest::engine_tests::two_identical_csv_rows_import_as_two_entries ... ok596test importers::harvest::resolve::preview::tests::checkpoint_restores_known_task_currency_and_keeps_old_currency_unknown ... ok597test importers::harvest::resolve::preview::tests::rejects_foreign_parent_snapshots_before_restoring_any_rows ... ok598test importers::harvest::streaming::durable::preview::tests::restoration_omits_unneeded_virtual_entries ... ok599test importers::harvest::streaming::tests::api_planning_policy_ends_with_the_transaction ... ok600test importers::harvest::sync_tests::api_rejects_ambiguous_email_without_advancing_watermark ... ok601test importers::harvest::engine_tests::lookup_cache::repeated_rows_resolve_each_user_and_project_task_once ... ok602test importers::harvest::sync_tests::api_requires_email_even_when_full_name_matches ... ok603test importers::harvest::sync_tests::checkpoints::durable_api_finalization_retry_does_not_repeat_completed_downloads ... ok604test importers::harvest::sync_tests::checkpoints::durable_api_cancellation_preserves_confirmed_pages_for_manual_retry ... ok605test importers::harvest::sync_tests::checkpoints::durable_api_preview_cancellation_preserves_confirmed_pages_for_manual_retry ... ok606test importers::harvest::sync_tests::checkpoints::durable_api_preview_finalization_retry_does_not_repeat_completed_downloads ... ok607test importers::harvest::engine_tests::large_run_reuses_parents_and_reconciles_totals ... ok608test importers::harvest::sync_tests::checkpoints::durable_api_preview_resume_preserves_row_errors ... ok609test importers::harvest::sync_tests::checkpoints::durable_api_preview_reclaimed_worker_cannot_checkpoint_its_next_page ... ok610test importers::harvest::engine_tests::csv_streaming::csv_measurement_recovers_a_complete_batch_without_recounting ... ok611test importers::harvest::sync_tests::checkpoints::durable_api_preview_resumes_catalog_download ... ok612test importers::harvest::sync_tests::checkpoints::durable_api_preview_resumes_pages_without_publishing_domain_data ... ok613test importers::harvest::sync_tests::checkpoints::durable_api_resume_keeps_earlier_errors_and_does_not_advance_watermark ... ok614test importers::harvest::sync_tests::checkpoints::durable_api_reclaimed_worker_cannot_commit_its_next_page ... ok615test importers::harvest::sync_tests::checkpoints::durable_api_resume_remembers_an_earlier_missing_timestamp ... ok616test importers::harvest::sync_tests::checkpoints::durable_api_preview_preserves_adoptions_and_repeated_ids_across_recovery ... ok617test importers::harvest::sync_tests::checkpoints::durable_api_resumes_a_partially_downloaded_catalog ... ok618test importers::harvest::sync_tests::checkpoints::durable_api_preview_resumes_after_a_confirmed_parent_batch ... ok619test importers::harvest::engine_tests::csv_streaming::durable_csv_preview_matches_existing_and_new_rows_with_one_connection ... ok620test importers::harvest::sync_tests::disconnect_and_reconnect_preserves_imported_records_and_exact_identity ... ok621test importers::harvest::sync_tests::dry_run_leaves_data_provenance_and_watermark_unchanged ... ok622test importers::harvest::sync_tests::failed_client_propagates_to_project_and_entry_without_placeholder_records ... ok623test importers::harvest::sync_tests::empty_sync_does_not_invent_a_watermark ... ok624test importers::harvest::sync_tests::checkpoints::failed_api_commit_publishes_its_last_confirmed_page_report ... ok625test importers::harvest::sync_tests::exact_api_decimals_survive_preview_commit_and_reimport ... ok626test importers::harvest::sync_tests::checkpoints::durable_api_resumes_committed_pages_and_preserves_the_high_watermark ... ok627test importers::harvest::sync_tests::checkpoints::failed_api_preview_publishes_its_last_confirmed_page_report ... ok628test importers::harvest::sync_tests::invalid_parent_blocks_dependent_time_but_other_catalog_records_survive ... ok629test importers::harvest::sync_tests::failed_rows_are_available_to_the_next_incremental_retry ... ok630test importers::harvest::sync_tests::missing_client_fallback_and_failed_project_savepoints_do_not_poison_cache ... ok631test importers::harvest::sync_tests::missing_source_timestamp_keeps_the_previous_watermark ... ok632test importers::harvest::sync_tests::out_of_range_api_decimals_error_per_row_and_leave_retry_watermark ... ok633test importers::harvest::sync_tests::paging::cancelled_page_consumer_retains_lock_until_worker_exits_and_rolls_back ... ok634test importers::harvest::sync_tests::checkpoints::durable_api_resumes_after_a_confirmed_parent_batch ... ok635test importers::harvest::sync_tests::paging::durable_api_stale_commit_cannot_advance_data_or_watermark ... ok636test importers::harvest::sync_tests::scale::api_100k_commit_and_reimport ... ignored, 100,000-entry scale measurement; run explicitly with --release --nocapture637test importers::harvest::sync_tests::scale::api_100k_dry_run ... ignored, 100,000-entry scale measurement; run explicitly with --release --nocapture638test importers::harvest::sync_tests::scale::api_durable_100k_commit_and_reimport ... ignored, 100,000-entry durable API measurement; run explicitly with --release --nocapture639test importers::harvest::sync_tests::scale::api_durable_100k_dry_run ... ignored, 100,000-entry durable API measurement; run explicitly with --release --nocapture640test importers::harvest::sync_tests::parent_catalog_preserves_metadata_and_counts_each_entity_once ... ok641test importers::harvest::sync_tests::paging::later_download_failure_rolls_back_parents_rows_and_watermark ... ok642test importers::harvest::sync_tests::parent_only_api_import_creates_catalog_and_reimport_skips_it ... ok643test importers::harvest::sync_tests::parent_only_dry_run_previews_without_persisting_catalog ... ok644test importers::harvest::sync_tests::refreshed_tokens_survive_a_dry_run_rollback_in_the_same_import_session ... ok645test importers::harvest::sync_tests::watermark_never_passes_the_start_of_capture ... ok646test importers::harvest::sync_tests::successful_sync_only_marks_the_incrementally_fetched_entity ... ok647test importers::harvest::sync_tests::watermark_write_failure_rolls_back_imported_data ... ok648test init::tests::init_creates_one_org_and_one_admin_and_nothing_else ... ok649test init::tests::init_refuses_when_an_organization_exists ... ok650test importers::harvest::sync_tests::paging::durable_api_cancel_waits_for_the_producer_before_acknowledging ... ok651test jobs::outbox::tests::acknowledges_confirmed_delivery_without_reclaiming_it ... ok652test importers::harvest::sync_tests::paging::invalid_and_missing_timestamp_rows_cross_page_boundaries_without_advancing ... ok653test jobs::report::stream_tests::download_keeps_its_snapshot_when_later_progress_archives_the_inline_tail ... ok654test jobs::outbox::tests::worker_delivers_available_events_and_stops_cleanly ... ok655test jobs::outbox::tests::plugin_failure_retries_with_the_same_event_identity ... ok656test jobs::outbox::tests::invalid_payload_is_not_delivered_and_does_not_leak_into_errors ... ok657test importers::harvest::sync_tests::scale::http_pages_preview_commit_and_reimport ... ok658test importers::harvest::sync_tests::scale::durable_measurement_finishes_from_its_eof_checkpoint ... ok659test jobs::report::tests::legacy_upgrade_preserves_job_states_and_existing_archives ... ok660test jobs::tests::cancellation_and_retry_are_scoped_and_idempotent ... ok661test jobs::report::stream_tests::download_reads_only_when_consumed_and_releases_its_connection ... ok662test jobs::tests::claims_are_atomic_and_expired_leases_recover ... ok663test jobs::report::stream_tests::download_reports_missing_fragments_after_its_buffered_page ... ok664test jobs::report::tests::upgrading_legacy_reports_preserves_errors_and_fences_old_attempts ... ok665test jobs::tests::cancellation_survives_a_crash_before_the_worker_acknowledges ... ok666test jobs::tests::api_job_keeps_its_policy_across_duplicate_enqueue_and_manual_retry ... ok667test jobs::tests::expired_lease_cannot_renew_or_commit_using_an_old_transaction_timestamp ... ok668test jobs::tests::cancellation_waits_for_the_claimed_execution_before_allowing_retry ... ok669test jobs::tests::failed_csv_preview_retains_confirmed_report_through_history_and_retry ... ok670test jobs::tests::final_failure_is_retained_and_manual_retry_gets_a_new_budget ... ok671test jobs::tests::history_paginates_tied_timestamps_and_rejects_foreign_cursors ... ok672test jobs::report::tests::report_fragments_survive_until_the_owning_job_expires ... ok673test importers::harvest::sync_tests::scale::durable_api_report_preserves_overflow_errors_after_recovery ... ok674test jobs::tests::failed_csv_commit_retains_confirmed_report_through_history_and_retry ... ok675test jobs::tests::concurrent_csv_resubmission_preserves_identity_after_upload_cleanup ... ok676test jobs::tests::invalid_stored_payloads_reach_a_terminal_error ... ok677test jobs::tests::import_adapters_reject_a_lease_from_another_organization ... ok678test jobs::tests::outbox_delivery_is_idempotent ... ok679test jobs::tests::missing_configuration_records_error_and_requeues ... ok680test jobs::tests::outbox_claims_only_the_requested_event_kind ... ok681test jobs::tests::outbox_stale_claims_cannot_acknowledge_or_reschedule_delivery ... ok682test jobs::tests::payload_kind_is_stable_and_round_trips ... ok683test jobs::tests::payload_versions_preserve_legacy_jobs_and_reject_unknown_versions ... ok684test jobs::tests::invalid_policy_cannot_enqueue_a_job_or_upload ... ok685test jobs::tests::retry_snapshot_does_not_guess_unknown_payloads_or_sources ... ok686test jobs::tests::outbox_rollback_does_not_publish_an_event ... ok687test jobs::tests::shutdown_deadline_drops_and_joins_in_flight_work ... ok688test jobs::tests::shutdown_waits_for_in_flight_work ... ok689test jobs::tests::retry_snapshot_matches_status_and_list_without_exposing_payload ... ok690test jobs::tests::csv_job_persists_its_policy_with_the_upload ... ok691test jobs::tests::reclaimed_attempt_rejects_stale_results_even_with_the_same_worker_name ... ok692test jobs::tests::cleanup_retains_retryable_uploads_and_deletes_expired_jobs ... ok693test jobs::tests::synthetic_job_uses_the_same_registered_envelope ... ok694test jobs::tests::missing_csv_upload_records_error_and_requeues ... ok695test models::project_creation::tests::draft_roundtrip_preserves_incomplete_input_without_demo_data ... ok696test models::project_creation::tests::unauthorized_catalog_cost_is_absent_from_serialized_options ... ok697test models::project_creation::tests::unknown_draft_fields_are_rejected ... ok698test models::project_managers::tests::command_preserves_durable_intent_and_strictly_decodes_its_discriminator ... ok699test jobs::tests::upload_organization_must_match_its_job ... ok700test notifications::tests::cancelling_delivery_kills_the_active_sender ... ok701test jobs::tests::submission_key_cannot_change_csv_bytes_or_mode ... ok702test notifications::tests::acknowledged_email_is_never_claimed_again ... ok703test notifications::tests::disabled_mail_worker_does_not_claim_pending_notifications ... ok704test notifications::tests::mail_configuration_is_disabled_by_default_and_rejects_partial_values ... ok705test notifications::tests::mail_configuration_requires_an_executable_file_and_safe_sender ... ok706test jobs::tests::synthetic_job_executes_through_claim_and_completion ... ok707test notifications::tests::recipient_injection_is_rejected_before_starting_a_process ... ok708test notifications::tests::rendered_mail_bounds_body_lines_for_long_unicode_and_control_names ... ok709test notifications::tests::failed_email_retries_same_identity_and_eventually_stops ... ok710test notifications::tests::foreign_notification_payload_is_terminal_and_never_sent ... ok711test notifications::tests::sendmail_failure_does_not_expose_program_output ... ok712test notifications::tests::sendmail_receives_fixed_arguments_and_stable_message_identity ... ok713test notifications::tests::mail_worker_delivers_only_its_kind_and_drains_cleanly ... ok714test jobs::tests::outbox_same_kind_consumers_cannot_claim_the_same_lease ... ok715test notifications::tests::retry_can_recover_without_changing_message_identity ... ok716test pages::clients::filters::tests::clearing_query_preserves_selected_currency_and_lifecycle ... ok717test pages::clients::filters::tests::lifecycle_counts_share_query_and_currency_filters ... ok718test pages::clients::filters::tests::name_search_ignores_case_and_surrounding_whitespace ... ok719test pages::clients::filters::tests::preferred_or_visible_project_currency_matches_but_query_still_applies ... ok720test pages::clients::form::tests::absent_billing_authority_never_produces_an_edit_payload ... ok721test pages::clients::form::tests::ambiguous_creation_errors_require_explicit_recovery ... ok722test pages::clients::form::tests::clearing_a_rate_is_explicit_and_needs_no_currency_confirmation ... ok723test pages::clients::form::tests::invalid_fields_are_not_rewritten_by_validation ... ok724test pages::clients::form::tests::rate_replacement_requires_confirmation_in_the_current_currency ... ok725test pages::clients::form::tests::untouched_fields_keep_zero_rate_and_original_snapshot ... ok726test pages::importers::presentation::tests::interrupted_report_is_partial_regardless_of_retry_prerequisites ... ok727test pages::importers::presentation::tests::no_selection_does_not_claim_no_import_history ... ok728test pages::importers::presentation::tests::source_labels_do_not_guess_unknown_importers ... ok729test pages::importers::presentation::tests::states_and_phases_have_readable_unknown_fallbacks ... ok730test pages::importers::presentation::tests::summaries_distinguish_zero_skipped_and_mixed_outcomes ... ok731test pages::invoices::defaults_form::tests::invoice_fields_bound_metadata_by_characters_and_reject_nul ... ok732test pages::invoices::defaults_form::tests::invoice_fields_preserve_exact_percentages_and_custom_terms ... ok733test pages::invoices::defaults_form::tests::invoice_fields_preserve_receipt_terms_and_empty_optional_percentages ... ok734test pages::invoices::defaults_form::tests::invoice_fields_reject_invalid_percentages_terms_and_second_tax ... ok735test pages::invoices::preparation::fees::tests::fee_inputs_require_exact_amounts_and_an_explicit_positive_charge ... ok736test pages::invoices::preparation::fees::tests::refresh_keeps_raw_edits_and_does_not_select_new_sources ... ok737test pages::invoices::preparation::fees::tests::refresh_preserves_missing_or_relabelled_edits_until_explicit_removal ... ok738test pages::invoices::preparation::tests::invoice_context_selects_only_the_exact_available_client ... ok739test pages::invoices::preparation::tests::invoice_review_requires_matching_sources_and_valid_values ... ok740test pages::invoices::preparation::tests::unavailable_or_malformed_invoice_context_never_uses_the_first_client ... ok741test pages::new_project::basics::tests::a_batch_that_would_exceed_the_tag_limit_is_rejected ... ok742test pages::new_project::basics::tests::a_full_tag_list_still_accepts_a_duplicate ... ok743test pages::new_project::basics::tests::overlong_tags_are_rejected_without_truncation ... ok744test pages::new_project::basics::tests::tag_length_counts_characters_instead_of_bytes ... ok745test pages::new_project::basics::tests::tags_trim_and_deduplicate_without_changing_existing_spelling ... ok746test pages::new_project::billing::tests::budget_errors_target_a_control_that_can_be_corrected ... ok747test pages::new_project::draft::tests::a_mismatched_acknowledgement_does_not_lose_pending_input ... ok748test pages::new_project::draft::tests::a_retry_keeps_the_unacknowledged_payload_and_revision ... ok749test pages::new_project::draft::tests::a_validation_rejection_allows_corrected_input_at_the_same_revision ... ok750test pages::new_project::draft::tests::an_empty_form_is_not_reported_as_saved ... ok751test pages::new_project::draft::tests::any_saved_draft_wins_over_context_including_empty_or_matching_client ... ok752test pages::new_project::draft::tests::context_prefills_only_a_new_form_without_fixing_its_currency ... ok753test pages::new_project::draft::tests::resuming_preserves_the_server_identity_and_incomplete_fields ... ok754test pages::new_project::team::tests::adding_everyone_deduplicates_without_replacing_project_overrides ... ok755test pages::new_project::team::tests::exceeding_the_team_limit_does_not_partially_add_people ... ok756test pages::new_project::team::tests::removing_a_member_keeps_an_empty_restricted_task_restricted ... ok757test pages::new_project::tests::a_rejected_creation_can_be_edited_but_an_uncertain_commit_must_be_retried ... ok758test pages::new_project::tests::only_known_validation_fields_can_target_a_control ... ok759test pages::projects::budget_display_tests::configured_scopes_sum_without_hiding_an_individual_overrun ... ok760test pages::projects::budget_display_tests::display_preserves_units_sign_and_large_integer_values ... ok761test pages::projects::budget_display_tests::tag_filter_matches_identity_without_duplicates_or_name_collisions ... ok762test pages::projects::budget_display_tests::unallocated_zero_and_overflow_budgets_are_not_conflated ... ok763test pages::reports::tests::cost_total_uses_organization_currency_across_billing_currencies ... ok764test pages::reports::tests::mixed_currencies_are_not_added_even_when_the_numbers_would_overflow ... ok765test pages::reports::tests::monetary_total_overflow_is_visible_instead_of_panicking ... ok766test pages::reports::tests::redacted_costs_do_not_become_zero_or_partial_totals ... ok767test pages::reports::tests::single_currency_totals_are_formatted_and_empty_reports_have_no_amount ... ok768test pages::settings::own_permissions::tests::own_permissions_view_admin_identity_is_explicit_not_derived_from_grants ... ok769test pages::settings::own_permissions::tests::own_permissions_view_distinguishes_authentication_forbidden_and_failure ... ok770test pages::settings::own_permissions::tests::own_permissions_view_does_not_disclose_internal_fields_or_offer_edits ... ok771test pages::settings::own_permissions::tests::own_permissions_view_empty_grants_are_not_normalized ... ok772test pages::settings::own_permissions::tests::own_permissions_view_grants_do_not_promise_unavailable_features ... ok773test pages::settings::own_permissions::tests::own_permissions_view_legacy_is_not_empty_or_a_profile ... ok774test pages::settings::own_permissions::tests::own_permissions_view_loading_hides_previous_snapshot ... ok775test pages::settings::own_permissions::tests::own_permissions_view_preserves_exact_grants_without_profile_inference ... ok776test pages::settings::own_permissions::tests::own_permissions_view_unsupported_catalog_hides_uninterpretable_grants ... ok777test pages::timesheet::data::tests::completes_pages_while_pinning_subject_requester_and_policy ... ok778test pages::timesheet::data::tests::empty_authorized_sheet_is_a_complete_result ... ok779test pages::timesheet::data::tests::later_page_failure_does_not_return_partial_totals ... ok780test pages::timesheet::data::tests::old_week_results_and_errors_are_not_current_even_before_restart ... ok781test pages::timesheet::data::tests::refuses_a_changed_requester_subject_or_policy_between_pages ... ok782test pages::timesheet::data::tests::rejects_a_nonadvancing_cursor_instead_of_looping ... ok783test pages::timesheet::data::tests::rejects_mixed_subjects_out_of_window_rows_and_duplicates ... ok784test pages::timesheet::data::tests::rejects_rows_repeated_across_pages ... ok785test pages::timesheet::data::tests::rejects_the_wrong_first_subject_or_requester ... ok786test pages::timesheet::refresh_tests::discarding_a_row_removes_its_drafts_only_for_the_captured_week ... ok787test pages::timesheet::refresh_tests::typing_in_another_cell_survives_a_save_refresh ... ok788test pages::timesheet::tests::cal_span_day_shows_only_the_anchor_column ... ok789test pages::timesheet::tests::cal_span_defaults_to_week ... ok790test pages::timesheet::tests::cal_span_unknown_falls_back_to_week ... ok791test pages::timesheet::tests::cal_span_url_roundtrips ... ok792test pages::timesheet::tests::cal_span_week_shows_all_seven_days ... ok793test pages::timesheet::tests::cal_span_work_week_preserves_date_order_across_weekends ... ok794test pages::timesheet::tests::cal_span_work_week_shows_monday_to_friday ... ok795test pages::timesheet::tests::cal_span_work_week_skips_sunday_when_it_is_the_first_column ... ok796test pages::timesheet::tests::day_col_class_marks_today ... ok797test pages::timesheet::tests::day_col_class_marks_weekend ... ok798test pages::timesheet::tests::day_col_class_plain_weekday ... ok799test pages::timesheet::tests::day_col_class_today_wins_over_weekend ... ok800test pages::timesheet::tests::delegated_stop_requires_the_exact_eligible_pair_and_keeps_state_locks ... ok801test pages::timesheet::tests::invalid_duration_cannot_start_a_timer_save_or_clear_a_cell ... ok802test pages::timesheet::tests::legacy_historical_edits_do_not_create_new_tracking_eligibility ... ok803test pages::timesheet::tests::only_a_blank_duration_can_start_an_eligible_timer ... ok804test pages::timesheet::tests::read_only_day_keeps_facts_but_disables_edit_and_start_buttons ... ok805test pages::timesheet::tests::terminal_stop_recovery_is_owner_only_when_tracking_is_lost ... ok806test pages::timesheet::tests::timed_lanes_still_widens_overlapping_entries ... ok807test pages::timesheet::tests::timed_lanes_terminates_on_a_zero_length_entry ... ok808test pages::timesheet::tests::today_offset_is_none_after_the_week ... ok809test pages::timesheet::tests::today_offset_is_none_before_the_week ... ok810test pages::timesheet::tests::today_offset_is_six_on_the_sunday ... ok811test pages::timesheet::tests::today_offset_is_zero_on_the_monday ... ok812test pages::timesheet::tests::value_cell_class_empty_wins_over_today ... ok813test pages::timesheet::tests::value_cell_class_marks_today_when_nonzero ... ok814test pages::timesheet::tests::visible_time_without_writable_tracking_does_not_enable_edit_controls ... ok815test pages::timesheet::tests::weekend_style_follows_the_date_not_the_column_offset ... ok816test pages::timesheet::tests::weekly_duration_edit_preserves_nine_am_start_notes_and_billability ... ok817test pages::timesheet::tests::weekly_new_entries_are_untimed_and_explicit_clears_still_work ... ok818test notifications::tests::verbose_sender_output_is_discarded_without_blocking_delivery ... ok819test notifications::tests::revoked_recipient_does_not_receive_a_pending_email ... ok820test notifications::tests::stale_email_lease_cannot_start_delivery ... ok821test jobs::tests::expired_final_attempt_fails_without_claiming_again ... ok822test plugin::database::tests::application_database_owner_is_not_a_plugin_identity ... ok823test plugin::database::tests::dedicated_reader_is_accepted_but_new_write_grants_are_rejected ... ok824test plugin::database::tests::project_configuration_is_private_even_when_plugin_grants_are_misconfigured ... ok825test plugin::database::tests::reader_accepts_optional_first_party_rounding_helper ... ok826test plugin::event::tests::active_transition_fires_only_on_a_real_flip ... ok827test plugin::event::tests::budget_and_timer_events_serialize ... ok828test plugin::event::tests::new_events_have_stable_hook_names ... ok829test plugin::event::tests::project_membership_payload_excludes_private_configuration ... ok830test plugin::event::tests::role_change_event_carries_previous_role ... ok831test plugin::event::tests::submission_event_serializes_payload ... ok832test plugin::event::tests::us2_events_have_stable_hook_names ... ok833test plugin::database::tests::reader_cannot_have_access_to_credentials ... ok834test plugin::host::tests::config_lookup::a_set_key_is_returned ... ok835test plugin::host::tests::config_lookup::an_unset_key_is_none ... ok836test plugin::database::tests::reader_cannot_execute_security_definer_functions ... ok837test notifications::tests::sendmail_timeout_kills_and_reaps_the_child ... ok838test plugin::database::tests::reader_cannot_switch_into_another_role ... ok839test plugin::database::tests::reader_rejects_unapproved_invoker_functions ... ok840test plugin::host::tests::database_tests::unconfigured_sql_never_falls_back_to_application_state ... ok841test plugin::host::tests::database_queries_preserve_parameters_and_rollback_session_settings ... ok842test plugin::host::tests::response_shaping::error_json_wraps_the_message ... ok843test plugin::host::tests::response_shaping::http_body_accepts_the_size_limit_and_rejects_larger_responses ... ok844test plugin::host::tests::response_shaping::http_response_carries_status_and_body ... ok845test plugin::host::tests::response_shaping::invalid_http_utf8_is_an_error_not_an_empty_success ... ok846test plugin::host::tests::statement_is_read_only::a_cte_select_is_allowed ... ok847test plugin::host::tests::statement_is_read_only::a_second_statement_is_rejected ... ok848test plugin::host::tests::statement_is_read_only::a_single_trailing_semicolon_is_allowed ... ok849test plugin::host::tests::statement_is_read_only::a_write_hidden_behind_a_comment_is_rejected ... ok850test plugin::host::tests::statement_is_read_only::plain_select_is_allowed ... ok851test plugin::host::tests::statement_is_read_only::writes_are_rejected ... ok852test plugin::host::tests::wrap_select::strips_a_trailing_semicolon_before_wrapping ... ok853test plugin::host::tests::wrap_select::wraps_as_a_bounded_row_query ... ok854test plugin::manifest::tests::accepts_all_published_business_events ... ok855test plugin::manifest::tests::config_defaults_to_empty_when_absent ... ok856test plugin::manifest::tests::parse_valid_manifest ... ok857test plugin::manifest::tests::parses_optional_config_table ... ok858test plugin::manifest::tests::reject_empty_hooks ... ok859test plugin::manifest::tests::reject_unknown_hook ... ok860test jobs::tests::submission_key_cannot_change_api_mode_or_scope ... ok861test plugin::host::tests::database_tests::query_discards_session_advisory_locks ... ok862test plugin::host::tests::database_tests::select_cannot_write_or_gain_application_privileges ... ok863test plugin::host::tests::database_tests::query_results_are_bounded_without_silent_truncation ... ok864test jobs::tests::stopped_worker_leaves_queued_jobs_unclaimed ... ok865866running 1 test867test plugin::registry::tests::initialization::guest_initializers_have_an_engine_instruction_budget ... ok868869test result: ok. 1 passed; 0 failed; 0 ignored; 0 measured; 1042 filtered out; finished in 0.15s870871872running 1 test873test plugin::registry::tests::initialization::guest_initializers_have_an_engine_instruction_budget ... ok874875test result: ok. 1 passed; 0 failed; 0 ignored; 0 measured; 1042 filtered out; finished in 0.28s876877878running 1 test879test plugin::registry::tests::initialization::guest_initializers_have_an_engine_instruction_budget ... ok880881test result: ok. 1 passed; 0 failed; 0 ignored; 0 measured; 1042 filtered out; finished in 0.32s882883884running 1 test885test plugin::registry::tests::initialization::guest_initializers_have_an_engine_instruction_budget ... ok886887test result: ok. 1 passed; 0 failed; 0 ignored; 0 measured; 1042 filtered out; finished in 0.34s888889test plugin::registry::tests::initialization::guest_initializers_have_an_engine_instruction_budget ... ok890test plugin::registry::tests::initialization::instruction_budget_is_replenished_for_each_call ... ok891test plugin::host::tests::database_tests::wasm_host_uses_the_restricted_connection_on_a_current_thread_runtime ... ok892test plugin::registry::tests::isolation::cancelling_a_waiter_keeps_capacity_reserved_until_the_host_call_exits ... ok893test plugin::host::tests::a_query_cannot_disable_its_own_deadline ... ok894test plugin::registry::tests::isolation::confirmed_dispatch_returns_overload_for_retry ... ok895test plugin::registry::tests::isolation::confirmed_dispatch_returns_plugin_failure_for_retry ... ok896test plugin::registry::tests::isolation::confirmed_dispatch_attempts_other_plugins_after_one_fails ... ok897test plugin::registry::tests::isolation::confirmed_dispatch_waits_for_the_plugin_to_finish ... ok898test plugin::registry::tests::isolation::events_execute_outside_the_async_worker ... ok899test plugin::registry::tests::isolation::different_plugins_share_the_running_call_limit ... ok900test plugin::registry::tests::isolation::loaded_plugins_cannot_start_with_excessive_memory ... ok901test plugin::registry::tests::isolation::loaded_plugins_cannot_grow_memory_past_the_limit ... ok902test plugin::registry::tests::isolation::oversized_wasm_output_is_rejected_before_copying_it ... ok903test plugin::registry::tests::isolation::pending_capacity_rejects_new_work_without_spawning_tasks ... ok904test plugin::registry::tests::isolation::widgets_execute_outside_the_async_worker ... ok905test plugin::registry::tests::load_empty_directory ... ok906test plugin::registry::tests::load_nonexistent_directory ... ok907test plugin::registry::tests::isolation::a_wasm_timeout_releases_the_worker_and_instance ... ok908test plugin::registry::tests::isolation::oversized_event_payloads_are_not_queued ... ok909test reports::bounded::tests::cancelled_export_keeps_its_slot_until_the_renderer_exits ... ok910test reports::bounded::tests::export_admission_stays_reserved_until_the_body_is_dropped ... ok911test reports::bounded::tests::export_rendering_runs_off_the_async_worker ... ok912test reports::bounded::tests::output_budget_checks_writes_and_seeks_without_truncation ... ok913test reports::bounded::tests::rendered_output_limit_rejects_oversized_files_and_releases_admission ... ok914test render::tests::invoice_template_formats_large_minor_units_exactly ... ok915test reports::bounded::tests::renderer_errors_and_panics_release_admission ... ok916test reports::bounded::tests::timed_out_export_keeps_its_slot_until_the_renderer_exits ... ok917test plugin::registry::tests::collect_widgets_from_echo_plugin ... ok918test plugin::registry::tests::load_test_plugins ... ok919test plugin::registry::tests::dispatch_event_with_no_subscribers ... ok920test reports::limits::tests::bounded_entries_enforce_the_row_limit_after_all_filters ... ok921test reports::limits::tests::bounded_entries_reject_large_fields_and_combined_text ... ok922test plugin::registry::tests::failing_plugin_does_not_block_caller ... ok923test plugin::registry::tests::dispatch_invoice_sent_to_echo_plugin ... ok924test plugin::registry::tests::dispatch_to_echo_plugin_succeeds ... ok925test reports::limits::tests::measure_bounded_export_limits ... ignored, manual release export measurement; set HORAE_EXPORT_PROBE_DIR for artifacts926test reports::limits::tests::bounded_exports_preserve_real_workbooks_and_deterministic_pdf ... ok927test reports::limits::tests::export_size_checks_and_reads_share_a_repeatable_read_snapshot ... ok928test reports::limits::tests::bounded_invoice_limits_include_branding_and_preserve_tenant_scope ... ok929test reports::privacy_tests::unauthorized_project_text_does_not_affect_export_size_limits ... ok930test reports::limits::tests::fee_exports_preserve_absent_quantities_and_render_a_real_pdf ... ok931test reports::streaming::database_tests::measure_streaming_csv_export ... ignored, Manual release measurement of a 100,000-row CSV download932test reports::streaming::database_tests::a_real_database_error_interrupts_the_csv_body ... ok933test reports::streaming::database_tests::dropping_streamed_timesheet_closes_its_database_connection ... ok934test reports::streaming::database_tests::streamed_invoice_metadata_and_lines_share_one_snapshot ... ok935test reports::limits::tests::bounded_projects_filter_archives_before_size_checks ... ok936test reports::streaming::database_tests::streamed_projects_preserve_scope_budget_and_tenant_isolation ... ok937test reports::limits::tests::invoice_exports_show_saved_adjustments_and_exact_large_amounts ... ok938test reports::streaming::database_tests::streamed_timesheet_exceeds_xlsx_row_limit_without_one_large_body_chunk ... ok939test reports::streaming::tests::completed_csv_keeps_admission_until_body_drop ... ok940test reports::streaming::tests::csv_backpressure_and_body_drop_bound_and_cancel_source_reads ... ok941test reports::streaming::tests::csv_does_not_truncate_a_quoted_unicode_record_larger_than_a_chunk ... ok942test reports::streaming::tests::csv_emits_a_chunk_before_the_source_finishes ... ok943test reports::streaming::tests::csv_failure_or_panic_after_a_chunk_is_not_successful_eof ... ok944test reports::streaming::tests::csv_startup_errors_are_http_errors_and_release_admission ... ok945test reports::streaming::database_tests::streamed_tag_filter_excludes_other_projects_without_duplicating_rows ... ok946test reports::streaming::tests::dropping_csv_during_startup_cancels_the_producer ... ok947test route::tests::client_detail_preserves_identity_and_highlights_only_clients ... ok948test route::tests::client_workflow_paths_preserve_context_and_navigation_section ... ok949test route::tests::edit_project_preserves_identity_and_highlights_only_projects ... ok950test route::tests::existing_timesheet_links_without_a_person_still_select_own_time ... ok951test route::tests::invalid_timesheet_person_is_not_silently_removed_from_the_route ... ok952test route::tests::malformed_context_reaches_the_workflow_for_validation_after_recovery ... ok953test route::tests::new_project_is_static_and_highlights_only_projects ... ok954test route::tests::timesheet_routes_preserve_selected_person_in_every_view ... ok955test seed::tests::concurrent_init_and_seed_cannot_mix_organizations ... ok956test reports::streaming::tests::csv_timeout_interrupts_an_already_started_body ... ok957test seed::tests::concurrent_initializers_cannot_create_two_organizations ... ok958test reports::streaming::database_tests::streamed_timesheet_preserves_csv_escaping_frozen_zero_and_all_filters ... ok959test reports::limits::tests::export_queries_are_read_only_and_have_a_database_deadline ... ok960test seed::tests::late_seed_failure_rolls_back_all_demo_data ... ok961test seed::tests::repeated_seed_preserves_every_row_and_user_edits ... ok962test seed::tests::concurrent_seed_runs_create_only_one_demo ... ok963test server_fns::approvals::submission_tests::admitted_submission_finishes_before_access_change ... ok964test seed::tests::seed_refuses_a_second_organization_even_when_the_demo_exists ... ok965test server_fns::approvals::submission_tests::cancelling_a_submission_releases_its_write_barrier ... ok966test seed::tests::seed_leaves_an_older_or_partial_demo_unchanged ... ok967test server_fns::approvals::submission_tests::submission_accepts_the_organizations_sunday_start ... ok968test server_fns::approvals::submission_tests::submission_barrier_allows_shared_writers_for_the_same_user ... ok969test server_fns::approvals::submission_tests::submission_does_not_wait_for_another_users_writer ... ok970test server_fns::approvals::submission_tests::submission_freezes_the_minutes_after_a_competing_edit ... ok971test reports::privacy_tests::project_downloads_follow_progress_visibility ... ok972test server_fns::approvals::submission_tests::submission_rechecks_policy_and_activity_after_access_change ... ok973test server_fns::approvals::submission_tests::submission_rejects_a_start_that_is_not_the_organizations_week_start ... ok974test server_fns::approvals::submission_tests::submission_uses_one_pool_connection ... ok975test reports::limits::tests::tag_filter_applies_before_xlsx_size_checks_and_rendering ... ok976test server_fns::approvals::submission_tests::submission_waits_for_a_new_timer_before_checking_the_week ... ok977test server_fns::approvals::tests::ignores_stopped_and_out_of_week_timers ... ok978test server_fns::approvals::tests::sees_a_running_timer_inside_the_week ... ok979test server_fns::budget_tests::concurrent_budget_checks_have_one_band_claimant ... ok980test server_fns::budget_tests::budget_notification_schema_enforces_tenants_and_no_public_access ... ok981test server_fns::budget_tests::configured_alert_and_outbox_roll_back_together ... ok982test reports::streaming::database_tests::streamed_fee_invoice_has_no_fabricated_hours_or_hourly_rate ... ok983test server_fns::budget_tests::configured_alert_recipients_are_active_same_org_managers_and_project_leads ... ok984test server_fns::budget_tests::configured_alerts_require_enabled_active_project_and_authorized_recipient ... ok985test server_fns::budget_tests::configured_amount_budget_uses_resolved_rates_and_explicit_zero ... ok986test server_fns::budget_tests::configured_alerts_deduplicate_concurrent_checks_and_recrossing ... ok987test reports::streaming::database_tests::streamed_invoice_uses_stored_exact_cents_and_tenant_scoped_metadata ... ok988test server_fns::budget_tests::configured_budget_does_not_read_foreign_or_legacy_projects ... ok989test server_fns::budget_tests::configured_budget_sweep_recovers_missed_checks_without_duplicates ... ok990test server_fns::budget_tests::configured_monthly_budget_excludes_other_months_and_nonbillable_time ... ok991test server_fns::budget_tests::configured_nonbillable_projects_count_time_without_hidden_checkbox ... ok992test server_fns::budget_tests::configured_monthly_budget_includes_leap_day_and_preserves_locked_rounding ... ok993test seed::tests::seed_refuses_an_initialized_organization_without_writes ... ok994test server_fns::budget_tests::configured_person_budget_excludes_other_people_and_has_its_own_alert ... ok995test server_fns::budget_tests::configured_task_and_person_budgets_do_not_share_consumption ... ok996test server_fns::budget_tests::configured_task_fee_budget_respects_billability_and_alert_scope ... ok997test server_fns::budget_tests::overview_budget_progress_batches_projects_without_mixing_scopes ... ok998test server_fns::budget_tests::overview_budget_progress_includes_people_without_an_allowance ... ok999test server_fns::clients::tests::both_activation_transitions_change_once_and_preserve_details ... ok1000test server_fns::clients::tests::client_default_rate_allows_detail_edits_and_equivalent_currency ... ok1001test server_fns::budget_tests::overview_budget_progress_is_current_period_scoped_and_authorized ... ok1002test server_fns::clients::tests::client_default_rate_prevents_currency_relabelling ... ok1003test server_fns::clients::tests::client_details_distinguish_unset_zero_and_positive_manager_rates ... ok1004test server_fns::clients::tests::client_details_keep_catalog_identity_but_omit_member_billing ... ok1005test server_fns::clients::tests::client_details_hide_foreign_missing_and_inactive_actor_records ... ok1006test server_fns::clients::tests::client_invoices_reject_a_winning_concurrent_revocation ... ok1007test server_fns::clients::tests::client_invoices_hold_authority_until_the_read_finishes ... ok1008test server_fns::clients::tests::client_invoices_require_manager_authority_even_without_invoices ... ok1009test server_fns::clients::tests::client_invoices_keep_exact_client_scope_statuses_and_currencies ... ok1010test server_fns::clients::tests::client_summaries_exclude_foreign_clients_and_unreadable_project_currencies ... ok1011test server_fns::clients::tests::client_summaries_follow_existing_progress_visibility_and_revoke_inactive_users ... ok1012test server_fns::clients::tests::client_summaries_reject_a_foreign_actor_even_when_client_org_is_known ... ok1013test server_fns::clients::tests::client_summaries_keep_catalog_without_projects_and_count_archived_projects ... ok1014test server_fns::clients::tests::currency_edit_rechecks_a_concurrently_added_client_default_rate ... ok1015test server_fns::clients::tests::concurrent_deletion_is_not_an_unchanged_mutation ... ok1016test server_fns::clients::tests::missing_and_foreign_clients_are_not_noops ... ok1017test server_fns::clients::tests::each_field_changes_once_and_preserves_inactive_status ... ok1018test server_fns::clients::tests::profile_create_persists_normalized_identity_and_exact_optional_rate ... ok1019test server_fns::clients::tests::profile_currency_change_without_a_rate_keeps_it_unset ... ok1020test server_fns::clients::tests::profile_saves_recheck_manager_org_and_active_actor ... ok1021test server_fns::clients::tests::profile_noop_preserves_row_and_returns_no_update_event_signal ... ok1022test server_fns::clients::tests::profile_update_preserves_historical_rows_and_inactive_status ... ok1023test server_fns::clients::tests::profile_update_rechecks_authority_after_waiting_for_a_concurrent_demotion ... ok1024test server_fns::clients::tests::profile_saves_reject_invalid_input_without_partial_writes ... ok1025test server_fns::clients::tests::profile_update_rechecks_financial_snapshot_after_waiting_for_a_concurrent_edit ... ok1026test server_fns::clients::tests::profile_update_rejects_stale_currency_even_when_the_rate_is_still_unset ... ok1027test server_fns::clients::tests::profile_update_requires_explicit_rate_intent_for_currency_changes ... ok1028test server_fns::importers::authorization_tests::cli_job_endpoints_have_stable_registered_paths ... ok1029test server_fns::clients::tests::profile_update_rejects_stale_rate_even_when_the_target_currency_is_unchanged ... ok1030test server_fns::importers::authorization_tests::report_stress::large_report_streams_over_http_without_buffering_the_archive ... ignored, isolated Linux HTTP/memory stress; run with --release --exact --ignored --nocapture1031test server_fns::importers::authorization_tests::request_bound_import_endpoints_are_not_registered ... ok1032test server_fns::clients::tests::repeating_a_competing_deactivation_does_not_report_a_transition ... ok1033test server_fns::importers::csv_upload::tests::csv_upload_requires_its_header_without_reading_the_body ... ok1034test server_fns::importers::tests::concurrent_api_import_returns_a_retryable_conflict ... ok1035test server_fns::importers::csv_upload::tests::csv_upload_extractor_preserves_raw_bytes ... ok1036test server_fns::importers::tests::submission_identity_rejects_expired_future_and_non_v7_keys ... ok1037test server_fns::importers::tests::csv_route_rejects_invalid_modes_and_headers_without_reading_uploads ... ok1038test server_fns::clients::tests::repeating_a_competing_edit_does_not_report_a_change ... ok1039test server_fns::clients::tests::unchanged_activation_preserves_the_row ... ok1040test server_fns::clients::tests::restoring_a_competing_deactivation_reports_reactivation ... ok1041test server_fns::clients::tests::restoring_values_after_a_competing_edit_reports_a_change ... ok1042test server_fns::clients::tests::unchanged_edit_preserves_the_row ... ok1043test server_fns::invoices::fee_tests::concurrent_invoices_claim_a_single_fee_once ... ok1044test server_fns::importers::authorization_tests::job_endpoints_enforce_session_role_and_organization ... ok1045test server_fns::invoices::fee_tests::fee_invoice_does_not_claim_hours_or_another_clients_fee ... ok1046test server_fns::invoices::fee_tests::concurrent_discounted_invoice_retries_return_one_invoice ... ok1047test server_fns::invoices::fee_tests::fee_occurrence_rejects_cross_organization_project ... ok1048test server_fns::invoices::fee_tests::discounted_fee_leaves_a_balance_and_void_releases_only_its_contribution ... ok1049test server_fns::invoices::fee_tests::fee_total_overflow_rolls_back_occurrences_and_invoice ... ok1050test server_fns::invoices::fee_tests::draft_fee_edit_requires_current_balance_and_exact_excess_confirmation ... ok1051test server_fns::invoices::fee_tests::invoice_line_sources_reject_mixed_sources_and_invented_fee_quantities ... ok1052test server_fns::invoices::fee_tests::draft_fee_edit_rejects_invalid_lines_and_current_unauthorized_actors ... ok1053test server_fns::invoices::fee_tests::invoice_status_rechecks_authority_after_waiting_for_the_invoice_lock ... ok1054test server_fns::invoices::fee_tests::fee_preview_discount_ties_follow_source_keys_not_display_dates ... ok1055test server_fns::invoices::fee_tests::milestones_include_unbilled_overdue_fees_but_not_future_fees ... ok1056test server_fns::invoices::fee_tests::monthly_fees_use_calendar_dates_and_skip_already_claimed_months ... ok1057test server_fns::invoices::fee_tests::mixed_time_and_fee_discount_conserves_cents_without_reopening_time ... ok1058test server_fns::invoices::fee_tests::monthly_first_and_fifteenth_respect_partial_period_and_project_end ... ok1059test server_fns::invoices::fee_tests::invoice_defaults_apply_to_selected_fees_without_claiming_other_projects ... ok1060test server_fns::invoices::fee_tests::project_fee_context_matches_invoice_balances_and_current_authority ... ok1061test server_fns::invoices::fee_tests::prepared_fee_selection_rejects_invalid_values_and_empty_generation ... ok1062test server_fns::invoices::fee_tests::invoice_preview_does_not_materialize_fees_and_preserves_released_snapshots ... ok1063test server_fns::invoices::fee_tests::draft_fee_edit_serializes_retries_and_rejects_stale_revisions ... ok1064test server_fns::invoices::fee_tests::reviewed_generation_rejects_changed_time_before_claiming_it ... ok1065test server_fns::invoices::fee_tests::project_fee_context_keeps_monthly_balances_separate ... ok1066test server_fns::invoices::fee_tests::settled_fee_sources_remain_reviewable_without_automatic_charges ... ok1067test server_fns::invoices::fee_tests::single_fee_can_be_invoiced_without_time ... ok1068test server_fns::invoices::fee_tests::reviewed_generation_requires_exact_excess_and_current_authority ... ok1069test server_fns::invoices::fee_tests::void_releases_fee_identity_without_rewriting_the_original_line ... ok1070test server_fns::invoices::preview::tests::excess_rejects_an_unrepresentable_total_even_when_the_remainder_fits ... ok1071test server_fns::invoices::preview::tests::unselected_fee_currencies_do_not_relabel_or_block_selected_charges ... ok1072test server_fns::invoices::fee_tests::removing_discount_and_billing_the_remainder_cannot_both_succeed ... ok1073test server_fns::invoices::fee_tests::draft_fee_edit_replaces_amount_and_preserves_source_and_retry_identity ... ok1074test server_fns::invoices::tests::billing_cascade_agrees_across_all_four_levels_including_zero ... ok1075test server_fns::invoices::tests::configured_fixed_fee_hours_are_not_invoiced_but_legacy_fees_are_unchanged ... ok1076test server_fns::invoices::fee_tests::fee_preview_keeps_source_identity_and_reports_discounted_draft_balances ... ok1077test server_fns::invoices::tests::configured_project_currency_and_cost_override_keep_their_denominations ... ok1078test server_fns::invoices::tests::effective_minutes_migration_preserves_historical_invoice_quantities ... ok1079test server_fns::invoices::fee_tests::reviewed_generation_does_not_materialize_unselected_months ... ok1080test server_fns::invoices::fee_tests::zero_fee_is_invoiced_once_until_voided ... ok1081test server_fns::invoices::fee_tests::reviewed_generation_bills_partial_fees_and_rejects_stale_balances ... ok1082test server_fns::invoices::tests::imported_rates::rejected_import_rate_does_not_poison_the_next_row_or_its_catalog_rate ... ok1083test server_fns::invoices::tests::imported_rates::imported_legacy_project_keeps_exact_rates_and_totals_on_retry ... ok1084test server_fns::invoices::tests::effective_minutes_sql_matches_domain_rounding ... ok1085test server_fns::invoices::tests::imported_rates::imported_task_rates_require_matching_currency_only_for_new_configured_links ... ok1086test server_fns::invoices::tests::invoice_defaults_conflict_rolls_back_all_claims ... ok1087test server_fns::invoices::tests::invoice_defaults_validate_all_override_fields ... ok1088test server_fns::invoices::tests::invoice_line_overflow_leaves_time_unbilled ... ok1089test server_fns::invoices::fee_tests::fee_balance_migration_allocates_discount_without_rewriting_invoice_snapshots ... ok1090test server_fns::invoices::tests::invoice_defaults_are_invoice_owned_and_only_drafts_are_editable ... ok1091test server_fns::invoices::tests::assignment_gate_allows_inflight_invoice_organization_fks_to_finish ... ok1092test server_fns::invoices::tests::invoice_preview_requires_explicit_resolution_and_scopes_selected_projects ... ok1093test server_fns::invoices::tests::invoice_total_overflow_leaves_all_time_unbilled ... ok1094test server_fns::invoices::tests::invoice_defaults_selection_rejects_unavailable_projects_before_claiming ... ok1095test server_fns::invoices::tests::invoice_transitions_reject_invalid_states_and_foreign_organizations ... ok1096test server_fns::invoices::tests::invoice_defaults_legacy_insert_preserves_dates_and_exact_total ... ok1097test server_fns::invoices::tests::invoiced_amounts_survive_rate_changes_and_void_uses_current_rates ... ok1098test server_fns::invoices::tests::invoiced_billability_survives_later_project_changes ... ok1099test server_fns::invoices::tests::invoicing_leaves_running_time_open ... ok1100test server_fns::invoices::tests::invoicing_uses_and_freezes_effective_minutes ... ok1101test server_fns::invoices::tests::large_invoice_and_reports_agree_without_intermediate_overflow ... ok1102test server_fns::invoices::tests::mixed_project_currencies_cannot_partially_create_an_invoice ... ok1103test server_fns::invoices::tests::non_billable_context_produces_no_unbilled_amount_on_any_report ... ok1104test server_fns::invoices::tests::invoice_preview_rejects_large_results_instead_of_truncating_them ... ok1105test server_fns::invoices::tests::only_running_time_does_not_create_an_invoice ... ok1106test server_fns::invoices::tests::project_rate_is_used_by_invoices_reports_and_spend ... ok1107test server_fns::invoices::tests::void_reopens_time_without_stale_rounding ... ok1108test server_fns::invoices::tests::invoice_defaults_edit_rechecks_status_after_waiting_for_a_concurrent_send ... ok1109test server_fns::organization::tests::each_branding_field_changes_once_including_null_and_empty ... ok1110test server_fns::invoices::tests::void_waits_for_a_concurrent_payment_and_then_refuses ... ok1111test server_fns::organization::tests::missing_organization_is_not_an_unchanged_update ... ok1112test server_fns::invoices::tests::selected_project_rate_modes_agree_across_billing_consumers ... ok1113test server_fns::organization::tests::repeating_a_competing_branding_edit_does_not_report_a_change ... ok1114test server_fns::invoices::tests::invoice_defaults_apply_exact_adjustments_and_payment_terms ... ok1115test server_fns::organization::tests::restoring_branding_after_a_competing_edit_reports_a_change ... ok1116test server_fns::organization::tests::unchanged_branding_preserves_the_row ... ok1117test server_fns::invoices::tests::invoice_preview_keeps_time_rates_and_defaults_in_one_snapshot ... ok1118test server_fns::permissions::audit_tests::administrator_reads_historical_template_without_intent_or_replay_result ... ok1119test server_fns::permissions::audit_tests::audit_reader_holds_requester_until_materialization_finishes ... ok1120test server_fns::permissions::audit_tests::browsing::history_page_reauthorizes_empty_and_continuation_requests_and_binds_requester ... ok1121test server_fns::invoices::tests::invoice_preview_matches_generation_without_claiming_time ... ok1122test server_fns::permissions::audit_tests::browsing::history_page_waits_for_revocation_commit_or_rollback_at_each_gate ... ok1123test server_fns::permissions::audit_tests::browsing::history_page_rejects_malformed_history_without_partial_success ... ok1124test server_fns::permissions::audit_tests::audit_reader_overrides_transaction_defaults_without_changing_connection ... ok1125test server_fns::permissions::audit_tests::current_administrator_reads_inactive_authors_history_without_live_state ... ok1126test server_fns::permissions::audit_tests::historical_decoder_distinguishes_missing_change_from_explicit_noop ... ok1127test server_fns::permissions::audit_tests::historical_decoder_rejects_missing_template_snapshots_and_invalid_grants ... ok1128test server_fns::permissions::audit_tests::historical_decoder_rejects_unknown_mixed_fields_and_invalid_revision_steps ... ok1129test server_fns::permissions::audit_tests::historical_person_snapshot_validates_provenance_without_inferring_admin_identity ... ok1130test server_fns::permissions::audit_tests::direct_deactivation_winning_user_lock_denies_audit_read ... ok1131test server_fns::permissions::audit_tests::failed_mutation_has_no_success_audit_and_reads_do_not_write ... ok1132test server_fns::permissions::audit_tests::browsing::history_pages_scope_before_limit_and_use_stable_exclusive_timestamp_id_bounds ... ok1133test server_fns::permissions::audit_tests::profile_and_project_history_decode_exact_changes_and_noops ... ok1134test server_fns::permissions::audit_tests::legacy_admin_and_all_grants_without_explicit_identity_cannot_read_audit ... ok1135test server_fns::permissions::audit_tests::browsing::cancelling_history_page_releases_both_authority_gates ... ok1136test server_fns::permissions::audit_tests::reader_winning_gate_finishes_before_revocation_and_later_reads_fail ... ok1137test server_fns::permissions::audit_tests::audit_timeout_preserves_stricter_limits_and_releases_locks ... ok1138test server_fns::permissions::audit_tests::tenant_activity_and_policy_checks_precede_receipt_existence_and_decode ... ok1139test server_fns::permissions::audit_tests::cancelled_audit_read_releases_both_gates_and_single_connection ... ok1140test server_fns::permissions::audit_tests::browsing::admitted_history_page_finishes_before_revocation_at_each_gate ... ok1141test server_fns::permissions::audit_tests::operator_attribution_is_not_a_user_and_excludes_private_replay_payload ... ok1142test server_fns::permissions::audit_tests::revocation_winning_gate_denies_waiting_historical_reader ... ok1143test server_fns::permissions::own_tests::own_permissions_legacy_mode_never_discloses_staging ... ok1144test server_fns::permissions::audit_tests::profile_history_keeps_removed_relationships_after_grants_change_again ... ok1145test server_fns::permissions::profile_tests::adjusted_template_reset_and_replay_after_deletion_use_explicit_intent ... ok1146test server_fns::permissions::own_tests::own_permissions_scope_is_sorted_and_excludes_membership_and_other_managers ... ok1147test server_fns::permissions::audit_tests::template_detachment_history_preserves_exact_grants_and_provenance ... ok1148test server_fns::permissions::profile_tests::all_grant_template_cannot_confer_identity_and_cross_command_keys_conflict ... ok1149test server_fns::permissions::profile_tests::canonical_actor_policy_tenant_and_target_checks_precede_mutation ... ok1150test server_fns::permissions::own_tests::own_permissions_deny_invalid_identity_policy_and_state ... ok1151test server_fns::permissions::own_tests::own_permissions_reader_retains_actor_activity_until_snapshot_is_loaded ... ok1152test server_fns::permissions::profile_tests::audit_failure_rolls_back_profile_and_both_relationship_sets ... ok1153test server_fns::permissions::profile_tests::directory_tests::directory_does_not_use_project_management_and_rechecks_relationship_removal ... ok1154test server_fns::permissions::profile_tests::directory_tests::directory_cancellation_releases_connection_and_preserves_pool_defaults ... ok1155test server_fns::permissions::own_tests::own_permissions_wait_for_current_actor_deactivation ... ok1156test server_fns::permissions::profile_tests::directory_tests::directory_scopes_before_activity_pagination_and_only_returns_basic_identity ... ok1157test server_fns::permissions::profile_tests::directory_tests::directory_rechecks_grant_revocation_and_direct_deactivation_after_wait ... ok1158test server_fns::permissions::own_tests::own_permissions_preserve_exact_grants_and_independent_identity ... ok1159test server_fns::permissions::profile_tests::directory_tests::directory_uses_each_profiles_people_grants_not_legacy_role_or_other_scope ... ok1160test server_fns::permissions::profile_tests::existing_user_share_lock_does_not_block_profile_command ... ok1161test server_fns::permissions::profile_tests::cancelled_profile_save_rolls_back_effects_and_releases_single_connection ... ok1162test server_fns::permissions::profile_tests::explicit_application_and_adjustments_preserve_confirmed_grants ... ok1163test server_fns::permissions::profile_tests::concurrent_self_demotions_leave_one_active_explicit_administrator ... ok1164test server_fns::permissions::profile_tests::management_schema_rejects_foreign_parents_self_links_and_duplicate_pairs ... ok1165test server_fns::permissions::profile_tests::directory_tests::directory_denies_legacy_foreign_inactive_and_invalid_authority_even_for_empty_pages ... ok1166test server_fns::permissions::own_tests::own_permissions_reload_after_winning_gate_under_repeatable_read_defaults ... ok1167test server_fns::permissions::profile_tests::last_active_administrator_cannot_be_demoted_or_replaced_by_equivalent_grants ... ok1168test server_fns::permissions::profile_tests::malformed_person_or_remaining_administrator_state_fails_closed ... ok1169test server_fns::permissions::profile_tests::profile_command_rechecks_remaining_administrator_after_deactivation_wait ... ok1170test server_fns::permissions::profile_tests::profile_command_overrides_readonly_defaults_locally ... ok1171test server_fns::permissions::profile_tests::explicit_identity_changes_and_inactive_targets_do_not_change_activation ... ok1172test server_fns::permissions::profile_tests::directory_tests::directory_orders_by_name_then_id_and_accepts_deleted_cursor_without_extra_page ... ok1173test server_fns::permissions::profile_tests::read_only_retention_and_explicit_keep_project_access_preserve_independent_person_losses ... ok1174test server_fns::permissions::profile_tests::profile_command_rechecks_target_activation_before_demotion ... ok1175test server_fns::permissions::profile_tests::profile_command_retains_target_activity_through_receipt_insert ... ok1176test server_fns::permissions::profile_tests::stale_template_and_org_revision_and_exhausted_revisions_roll_back ... ok1177test server_fns::permissions::profile_tests::time_entries_tests::time_reads_cancel_without_leaking_locks_or_changing_pool_defaults ... ok1178test server_fns::permissions::profile_tests::simultaneous_losses_require_exact_confirmation_preserve_history_and_never_restore_links ... ok1179test server_fns::permissions::profile_tests::profile_command_waits_for_direct_actor_deactivation_even_on_replay ... ok1180test server_fns::permissions::profile_tests::profile_demotion_retains_surviving_administrator_until_commit ... ok1181test server_fns::permissions::profile_tests::time_entries_tests::time_reads_finish_before_competing_revocation_when_read_admitted_first ... ok1182test server_fns::permissions::profile_tests::revocation_winning_gate_denies_new_and_replayed_changes ... ok1183test server_fns::permissions::profile_tests::time_entries_tests::time_reads_distinguish_project_management_from_membership_and_people_scope ... ok1184test server_fns::permissions::profile_tests::time_entries_tests::time_reads_exclude_foreign_parents_but_preserve_archived_history ... ok1185test server_fns::permissions::profile_tests::time_entries_tests::time_reads_page_ties_without_loss_and_filters_never_expand_scope ... ok1186test server_fns::permissions::profile_tests::timesheet_context_tests::sheet_holds_selected_activity_through_entry_delivery_and_releases_on_cancel ... ok1187test server_fns::permissions::profile_tests::reduced_administrator_and_stale_person_proposals_are_rejected ... ok1188test server_fns::permissions::profile_tests::recreated_relationship_invalidates_waiting_confirmation_without_partial_removal ... ok1189test server_fns::permissions::profile_tests::time_entries_tests::time_reads_recheck_grants_relationships_and_activity_after_wait ... ok1190test server_fns::permissions::profile_tests::timesheet_context_tests::sheet_rejects_changed_requester_or_policy_and_inaccessible_subject ... ok1191test server_fns::permissions::profile_tests::timesheet_people_tests::admitted_discovery_finishes_before_competing_revocation ... ok1192test server_fns::permissions::profile_tests::time_entries_tests::time_reads_use_effective_profile_scope_and_union_without_duplicates ... ok1193test server_fns::permissions::profile_tests::time_entries_tests::time_reads_fail_closed_for_policy_identity_and_invalid_state ... ok1194test server_fns::permissions::profile_tests::timesheet_people_tests::cancellation_releases_discovery_locks_and_keeps_pool_defaults ... ok1195test server_fns::permissions::profile_tests::invalid_confirmations_and_noncanonical_grants_are_not_silently_repaired ... ok1196test server_fns::permissions::profile_tests::timesheet_people_tests::candidates_include_empty_project_members_and_retained_history_without_directory_access ... ok1197test server_fns::permissions::profile_tests::timesheet_people_tests::discovery_fails_closed_for_policy_identity_and_invalid_state ... ok1198test server_fns::permissions::profile_tests::timesheet_context_tests::sheet_exhausts_pages_and_does_not_reuse_scope_or_silently_change_policy ... ok1199test server_fns::permissions::profile_tests::timesheet_people_tests::discovery_rechecks_revocation_and_actor_activity_after_waiting ... ok1200test server_fns::permissions::profile_tests::timesheet_people_tests::history_keeps_archived_context_but_excludes_inactive_people_and_foreign_parents ... ok1201test server_fns::permissions::profile_tests::unchanged_and_unrelated_edits_do_not_clean_up_preexisting_incompatible_links ... ok1202test server_fns::permissions::profile_tests::timesheet_people_tests::profiles_and_custom_grants_use_time_scope_not_legacy_role_or_directory ... ok1203test server_fns::permissions::profile_tests::timesheet_context_tests::sheet_rechecks_selected_activity_after_waiting_for_archive ... ok1204test server_fns::permissions::profile_tests::timesheet_context_tests::sheet_selects_empty_managed_participant_without_widening_record_scope ... ok1205test server_fns::permissions::profile_tests::timesheet_context_tests::sheet_resolves_legacy_own_context_without_canonical_state ... ok1206test server_fns::permissions::project_management_tests::designation_is_required_before_managed_editor_can_delegate ... ok1207test server_fns::permissions::profile_tests::unchanged_edit_preserves_identity_source_timestamp_and_revisions ... ok1208test server_fns::permissions::project_management_tests::cancelled_project_delegation_rolls_back_and_releases_single_connection ... ok1209test server_fns::permissions::project_management_tests::canonical_actor_grants_activity_tenant_and_policy_are_required ... ok1210test server_fns::permissions::project_management_tests::concurrent_replacements_commit_only_one_current_revision ... ok1211test server_fns::permissions::project_management_tests::managed_scope_never_uses_another_project_or_legacy_membership ... ok1212test server_fns::permissions::project_management_tests::audit_failure_rolls_back_removal_addition_and_revision ... ok1213test server_fns::permissions::project_management_tests::project_delegation_denies_actor_deactivated_before_check ... ok1214test server_fns::permissions::project_management_tests::actual_template_command_receipt_cannot_be_reused_for_project_delegation ... ok1215test server_fns::permissions::project_management_tests::mixed_invalid_addition_preserves_entire_previous_set ... ok1216test server_fns::permissions::project_management_tests::historical_replay_does_not_reapply_removed_or_now_ineligible_designations ... ok1217test server_fns::permissions::project_management_tests::legacy_project_lock_returns_busy_instead_of_forming_an_org_fk_cycle ... FAILED1218test server_fns::permissions::project_management_tests::project_delegation_overrides_readonly_defaults_locally ... ok1219test server_fns::permissions::profile_tests::timesheet_people_tests::paging_search_and_identity_filters_only_narrow_current_scope ... ok1220test server_fns::permissions::project_management_tests::project_editor_delegates_existing_read_grants_without_promotion ... ok1221test server_fns::permissions::project_management_tests::foreign_missing_inactive_and_malformed_additions_fail_without_disclosure ... ok1222test server_fns::permissions::project_management_tests::project_delegation_denies_manager_deactivated_before_check ... ok1223test server_fns::permissions::project_management_tests::reader_tests::manager_reader_observes_direct_deactivation_before_its_actor_lock ... ok1224test server_fns::permissions::project_management_tests::project_delegation_retains_actor_activity_until_commit ... ok1225test server_fns::permissions::project_management_tests::reader_tests::manager_reader_materializes_before_a_waiting_actor_deactivation ... ok1226test server_fns::permissions::project_management_tests::replacement_audits_exact_delta_and_preserves_membership_history_and_other_scopes ... ok1227test server_fns::permissions::project_management_tests::reader_tests::manager_reader_preserves_the_complete_retained_set_without_private_fields ... ok1228test server_fns::permissions::project_management_tests::legacy_user_share_locks_allow_manager_and_receipt_foreign_keys ... ok1229test server_fns::permissions::project_management_tests::reader_tests::manager_reader_holds_authority_and_cancellation_releases_it ... ok1230test server_fns::permissions::project_management_tests::project_delegation_retains_added_manager_activity_until_commit ... ok1231test server_fns::permissions::project_management_tests::reader_tests::manager_reader_requires_current_project_edit_scope_not_identity_or_membership ... ok1232test server_fns::permissions::project_management_tests::transaction_tests::delegation_reuses_editor_gate_without_upgrading_past_foreign_keys ... ok1233test server_fns::permissions::project_management_tests::reader_tests::manager_reader_rechecks_revocation_after_the_organization_wait ... ok1234test server_fns::permissions::project_management_tests::stale_duplicate_and_exhausted_revisions_never_replace_the_set ... ok1235test server_fns::permissions::project_management_tests::receipt_conflicts_precede_decoding_and_replay_requires_current_authority ... ok1236test server_fns::permissions::project_management_tests::revocation_winning_gate_denies_waiting_delegation ... ok1237test server_fns::permissions::project_management_tests::retained_ineligible_managers_and_archived_projects_allow_noop_and_removal ... ok1238test server_fns::permissions::storage_tests::referenced_template_deletion_requires_detaching_without_grant_or_identity_loss ... ok1239test server_fns::permissions::storage_tests::source_shape_and_revision_constraints_reject_invalid_rows ... ok1240test server_fns::permissions::project_management_tests::transaction_tests::project_rollback_discards_managers_revision_and_receipt ... ok1241test server_fns::permissions::storage_tests::additive_migration_preserves_populated_legacy_records ... ok1242test server_fns::permissions::project_management_tests::transaction_tests::project_and_manager_changes_commit_with_the_same_receipt ... ok1243test server_fns::permissions::storage_tests::malformed_stored_grants_fail_without_repair ... ok1244test server_fns::permissions::storage_tests::person_grants_and_identity_round_trip_independently_of_source ... ok1245test server_fns::permissions::storage_tests::person_state_rejects_duplicates_and_foreign_users_and_templates ... ok1246test server_fns::permissions::storage_tests::template_names_are_case_insensitive_and_tenant_local ... ok1247test server_fns::permissions::storage_tests::concurrent_equivalent_names_create_only_one_template ... ok1248test server_fns::permissions::template_tests::concurrent_creators_never_exceed_fifty_profiles ... ok1249test server_fns::permissions::template_tests::delete_preserves_adjusted_grants_identity_and_business_rows ... ok1250test server_fns::permissions::storage_tests::unicode_name_migration_preserves_existing_templates ... ok1251test server_fns::permissions::template_tests::actor_share_lock_does_not_block_template_command ... ok1252test server_fns::permissions::template_tests::command_receipts_are_not_shared_between_administrators ... ok1253test server_fns::permissions::template_tests::equivalent_names_and_invalid_confirmed_selections_roll_back ... ok1254test server_fns::permissions::template_tests::failed_audit_insert_rolls_back_creation_and_detachment ... ok1255test server_fns::permissions::template_tests::delete_replay_does_not_touch_a_same_name_replacement ... ok1256test server_fns::permissions::storage_tests::unicode_name_collision_rolls_back_migration_without_changing_profiles ... ok1257test server_fns::permissions::template_tests::legacy_future_missing_foreign_and_non_admin_authority_deny ... ok1258test server_fns::permissions::storage_tests::storage_does_not_activate_or_infer_legacy_roles ... ok1259test server_fns::permissions::template_tests::receipts_enforce_tenant_exclusive_principal_and_request_uniqueness ... ok1260test server_fns::permissions::template_tests::revocation_winning_org_gate_denies_pending_replay_and_new_command ... ok1261test server_fns::permissions::template_tests::unknown_grants_and_authority_fields_cannot_deserialize_as_commands ... ok1262test server_fns::permissions::template_tests::template_command_overrides_readonly_defaults_and_keeps_stricter_timeouts ... ok1263test server_fns::permissions::template_tests::stale_foreign_and_exhausted_revisions_never_partially_delete ... ok1264test server_fns::project_creation::assignment_tests::finalization_reuses_catalog_and_keeps_lead_overrides_local_on_retry ... ok1265test server_fns::permissions::template_tests::concurrent_exact_retry_creates_one_receipt_without_changing_people ... ok1266test server_fns::project_creation::assignment_tests::invalid_assignment_graphs_leave_no_partial_creation_or_draft_change ... ok1267test server_fns::project_creation::editing::tests::concurrent_edits_have_one_winner_and_association_writes_invalidate_open_forms ... ok1268test server_fns::project_creation::editing::tests::editor_keeps_archived_selected_identities_and_nullable_overrides ... ok1269test server_fns::permissions::template_tests::malformed_assignee_aborts_all_detachments ... ok1270test server_fns::project_creation::editing::tests::editing_milestones_keeps_invoice_snapshots_and_fee_identities_immutable ... ok1271test server_fns::project_creation::editing::tests::editor_loads_legacy_values_without_fabricating_a_billing_mode_or_draft ... ok1272test server_fns::project_creation::editing::tests::editor_preserves_fee_schedule_and_operational_milestone_ids ... ok1273test server_fns::project_creation::editing::tests::editor_rechecks_tenant_role_and_active_status ... ok1274test server_fns::permissions::template_tests::template_command_waits_for_direct_actor_deactivation_on_replay ... ok1275test server_fns::project_creation::editing::tests::editor_recovers_full_configuration_and_redacts_private_values_after_role_change ... ok1276test server_fns::project_creation::editing::tests::editor_recovers_each_budget_scope_without_turning_absence_into_zero ... ok1277test server_fns::project_creation::editing::tests::foreign_actor_cannot_save_or_retry_another_organizations_edit ... ok1278test server_fns::project_creation::editing::tests::manager_edit_preserves_private_settings_and_cannot_remove_them_indirectly ... ok1279test server_fns::project_creation::editing::tests::save_edits_the_same_legacy_project_and_never_creates_a_draft_or_configuration ... ok1280test server_fns::project_creation::editing::tests::editor_load_uses_current_role_across_all_billing_configurations ... ok1281test server_fns::project_creation::editing::tests::save_updates_configured_sections_atomically_and_rejects_stale_or_invalid_edits ... ok1282test server_fns::project_creation::editing::tests::save_preserves_recorded_time_and_rejects_removing_its_task_or_person ... ok1283test server_fns::project_creation::editing::tests::saves_recheck_current_authority_and_do_not_repeat_noops ... ok1284test server_fns::project_creation::editing::tests::task_catalog_and_graph_changes_roll_back_together_on_duplicate_resolution ... ok1285test server_fns::permissions::template_tests::create_canonical_retry_returns_one_historical_change ... ok1286test server_fns::project_creation::tests::billing_schema_rejects_partial_fee_schedules ... ok1287test server_fns::project_creation::tests::client_dialog_validates_details_and_persists_an_explicit_zero_rate ... ok1288test server_fns::project_creation::tests::creation_actor_is_revalidated_inside_the_transaction ... ok1289test server_fns::project_creation::tests::creation_client_must_be_active_and_in_the_same_organization ... ok1290test server_fns::project_creation::import_tests::imported_catalog_rate_cannot_be_relabelled_as_workspace_currency ... ok1291test server_fns::project_creation::tests::draft_ownership_discard_and_role_changes_are_enforced ... ok1292test server_fns::project_creation::tests::draft_schema_enforces_one_current_draft_per_creator ... ok1293test server_fns::project_creation::tests::draft_save_retries_do_not_overwrite_a_newer_revision ... ok1294test server_fns::project_creation::tests::creation_options_are_scoped_bounded_and_redact_manager_costs ... ok1295test server_fns::project_creation::tests::draft_validation_preserves_incomplete_input_but_bounds_its_size ... ok1296test server_fns::project_creation::tests::final_validation_checks_invoice_defaults_and_scoped_budget_totals ... ok1297test server_fns::project_creation::tests::final_validation_preserves_exact_budgets_and_rejects_unavailable_email ... ok1298test server_fns::project_creation::tests::final_validation_requires_complete_fee_schedules_and_distinct_entities ... ok1299test server_fns::project_creation::tests::final_validation_requires_real_details_and_ignores_hidden_type_settings ... ok1300test server_fns::project_creation::tests::existing_projects_have_no_implicit_new_billing_configuration ... ok1301test server_fns::project_creation::tests::draft_schema_rejects_foreign_creator_and_completed_project ... ok1302test server_fns::project_creation::tests::draft_schema_rejects_oversize_payload_and_invalid_revision ... ok1303test server_fns::project_creation::tests::finalization_persists_task_access_and_project_only_financial_overrides ... ok1304test server_fns::project_creation::tests::managers_cannot_store_administrator_notes_or_costs_in_a_draft ... ok1305test server_fns::project_creation::tests::finalization_rechecks_client_role_revision_and_rate_currency ... ok1306test server_fns::project_creation::tests::missing_draft_responses_do_not_disclose_foreign_ownership ... ok1307test server_fns::project_creation::tests::invalid_task_rolls_back_project_and_keeps_the_draft ... ok1308test server_fns::project_creation::tests::finalize_is_atomic_and_repeated_submission_returns_one_project ... ok1309test server_fns::project_creation::import_tests::imports_preserve_finalized_project_configuration_and_restricted_access ... ok1310test server_fns::project_creation::validation::tests::assignment_rejections_identify_the_invalid_row ... ok1311test server_fns::project_creation::validation::tests::basic_rejections_identify_the_field_without_echoing_input ... ok1312test server_fns::project_creation::validation::tests::billing_rejections_identify_the_active_control ... ok1313test server_fns::project_creation::validation::tests::inactive_billing_inputs_remain_in_the_draft_without_blocking_creation ... ok1314test server_fns::project_creation::validation::tests::invoice_rejections_identify_the_field_without_echoing_input ... ok1315test server_fns::project_creation::validation::tests::milestone_rejections_target_the_invalid_row_by_identity ... ok1316test server_fns::project_creation::validation::tests::non_billable_projects_ignore_hidden_invoice_inputs ... ok1317test server_fns::project_creation::validation::tests::task_name_and_access_rejections_identify_the_invalid_row ... ok1318test server_fns::project_creation::tests::selected_catalog_bounds_requests_and_excludes_inactive_people ... ok1319test server_fns::project_creation::tests::selected_catalog_is_scoped_deduplicated_and_redacts_manager_costs ... ok1320test server_fns::project_creation::tests::selected_client_lookup_is_scoped_and_keeps_archived_identity ... ok1321test server_fns::project_creation::tests::simultaneous_draft_updates_have_one_winner ... ok1322test server_fns::project_creation::locking_tests::every_project_entry_gates_before_actor_and_rechecks_revocation ... ok1323test server_fns::projects::assignment_tests::assignment_mutations_wait_for_revocation_and_recheck_authority ... ok1324test server_fns::permissions::template_tests::invalid_stored_authority_and_template_grants_fail_closed ... ok1325test server_fns::projects::bulk_tests::bulk_accepts_one_hundred_projects_and_mixed_status_noops ... ok1326test server_fns::projects::bulk_tests::bulk_ids_validate_before_writes_and_normalize_duplicates ... ok1327test server_fns::projects::assignment_tests::stale_administrator_cannot_create_or_remove_after_revocation ... ok1328test server_fns::projects::bulk_tests::bulk_database_failure_rolls_back_earlier_changes ... ok1329test server_fns::projects::bulk_tests::bulk_missing_or_foreign_project_rolls_back_earlier_changes ... ok1330test server_fns::projects::bulk_tests::bulk_reversed_overlapping_batches_finish_without_deadlock ... ok1331test server_fns::projects::assignment_tests::own_assignment_lifecycle_preserves_role_and_duplicate_behavior ... ok1332test server_fns::projects::bulk_tests::bulk_preserves_invoiced_history_assignments_and_spend ... ok1333test server_fns::projects::bulk_tests::bulk_status_preserves_details_history_and_noop_versions ... ok1334test server_fns::projects::mutation_tests::project::both_activation_transitions_preserve_details_and_change_once ... ok1335test server_fns::projects::details_tests::project_details_only_offer_task_rate_currency_to_current_managers ... ok1336test server_fns::projects::mutation_tests::project::concurrent_deletion_is_rejected_by_both_mutations ... ok1337test server_fns::projects::assignment_tests::project_membership_and_task_callers_wait_before_authorizing ... ok1338test server_fns::projects::mutation_tests::project::budgets_and_rates_distinguish_null_zero_and_normalized_values ... ok1339test server_fns::permissions::template_tests::unsupported_receipt_version_fails_without_repeating_the_change ... ok1340test server_fns::projects::mutation_tests::project::configured_edits_recheck_settings_after_waiting_for_the_project ... ok1341test server_fns::projects::mutation_tests::project::configured_edits_preserve_non_hourly_billing ... ok1342test server_fns::projects::details_tests::project_details_and_tags_follow_current_progress_and_private_permissions ... ok1343test server_fns::projects::mutation_tests::project::configured_edits_preserve_compatible_changes_and_idempotence ... ok1344test server_fns::projects::mutation_tests::project::inactive_project_edits_preserve_identity_and_reject_implicit_migrations ... ok1345test server_fns::projects::mutation_tests::project::configured_edits_reject_incompatible_financial_changes_atomically ... ok1346test server_fns::projects::mutation_tests::project::invalid_project_fields_leave_the_row_unchanged ... ok1347test server_fns::projects::mutation_tests::project::repeating_a_competing_deactivation_reports_no_transition ... ok1348test server_fns::projects::assignment_tests::removal_preserves_foreign_and_malformed_assignments ... ok1349test server_fns::projects::mutation_tests::project::repeating_a_competing_edit_requires_a_fresh_revision ... ok1350test server_fns::projects::mutation_tests::project::missing_and_foreign_rows_are_not_noops ... ok1351test server_fns::projects::mutation_tests::project::restoring_a_competing_deactivation_reports_reactivation ... ok1352test server_fns::projects::mutation_tests::project::unchanged_activation_preserves_the_row ... ok1353test server_fns::projects::mutation_tests::project::restoring_a_competing_edit_does_not_overwrite_the_other_session ... ok1354test server_fns::projects::mutation_tests::task::both_activation_transitions_preserve_details_and_change_once ... ok1355test server_fns::projects::mutation_tests::project::unchanged_edit_preserves_the_row ... ok1356test server_fns::projects::assignment_tests::creation_rejects_foreign_and_unknown_project_or_person ... ok1357test server_fns::projects::mutation_tests::task::concurrent_deletion_returns_not_found_for_both_mutations ... ok1358test server_fns::projects::mutation_tests::task::each_detail_field_changes_once_and_preserves_inactive_status ... ok1359test server_fns::projects::mutation_tests::task::missing_and_foreign_rows_are_not_noops ... ok1360test server_fns::projects::mutation_tests::task::rate_edits_set_currency_without_relabelling_renames_or_noops ... ok1361test server_fns::projects::mutation_tests::task::restoring_a_competing_deactivation_reports_reactivation ... ok1362test server_fns::projects::mutation_tests::task::repeating_a_competing_deactivation_reports_no_transition ... ok1363test server_fns::projects::details_tests::unlinked_and_private_project_tags_do_not_leak_into_filters ... ok1364test server_fns::projects::mutation_tests::task::repeating_a_competing_edit_does_not_report_a_change ... ok1365test server_fns::projects::mutation_tests::task::restoring_a_competing_edit_reports_a_change ... ok1366test server_fns::projects::mutation_tests::task::unchanged_edit_preserves_the_row ... ok1367test server_fns::projects::mutation_tests::task::unchanged_activation_preserves_the_row ... ok1368test server_fns::projects::privacy_tests::client_project_filter_preserves_progress_access_and_rate_redaction ... ok1369test server_fns::projects::privacy_tests::private_progress_does_not_prevent_tracking_or_reveal_financial_fields ... ok1370test server_fns::projects::privacy_tests::legacy_members_retain_progress_without_new_settings ... ok1371test server_fns::projects::privacy_tests::outsiders_and_inactive_viewers_have_no_project_reads ... ok1372test server_fns::projects::privacy_tests::project_members_and_leads_receive_progress_without_rates ... ok1373test server_fns::projects::privacy_tests::revoked_membership_preserves_only_own_historical_tracking_identity ... ok1374test server_fns::projects::tests::assignments_are_scoped_to_the_viewers_organization ... ok1375test server_fns::projects::privacy_tests::project_reads_use_current_authority_and_reject_foreign_scope ... ok1376test server_fns::projects::tests::enabling_is_tenant_scoped_even_for_existing_links_and_preserves_overrides ... ok1377test server_fns::projects::tests::creating_a_project_task_enables_it_with_its_defaults ... ok1378test server_fns::projects::tests::enabling_tasks_rejects_explicit_rates_unused_by_the_project ... ok1379test server_fns::projects::tests::project_rate_distinguishes_inheritance_zero_and_exact_amounts ... ok1380test server_fns::projects::tests::enabling_tasks_accepts_exact_project_currency_rates_and_preserves_existing_links ... ok1381test server_fns::projects::tests::enabling_tasks_rejects_invalid_or_wrong_currency_explicit_rates_without_linking ... ok1382test server_fns::projects::tests::failed_project_task_creation_leaves_no_orphan_task ... ok1383test server_fns::projects::tests::enabling_tasks_rejects_incompatible_catalog_currency ... ok1384test server_fns::projects::tests::managers_and_admins_can_read_assignment_rates ... ok1385test server_fns::projects::tests::members_can_list_identities_but_not_assignment_rates ... ok1386test server_fns::projects::tests::project_rate_helper_has_no_public_execute_grant ... ok1387test server_fns::projects::tests::enabling_tasks_only_inherits_rates_used_by_configured_projects ... ok1388test server_fns::projects::tests::project_rate_sql_matches_rust_for_missing_zero_and_present_sources ... ok1389test server_fns::projects::tests::unknown_catalog_currency_requires_explicit_configured_rates_but_preserves_legacy ... ok1390test server_fns::reports::tests::filters_and_renames_keep_report_identity_and_totals ... ok1391test server_fns::time_entries::commands::tests::delegated_commands_keep_owner_and_apply_each_ordinary_intent ... ok1392test server_fns::time_entries::commands::tests::guards::all_intents_reject_read_only_inactive_and_stale_identities_atomically ... ok1393test server_fns::time_entries::commands::tests::guards::bulk_sets_do_not_partially_modify_foreign_locked_or_duplicate_entries ... ok1394test server_fns::reports::tests::manager_report_omits_groups_containing_private_project_costs ... ok1395test server_fns::time_entries::commands::tests::guards::coverage_conflicts_are_explicit_pending_submitted_editing_integration ... ok1396test server_fns::time_entries::commands::tests::guards::legacy_own_history_is_editable_without_becoming_new_tracking_authority ... ok1397test server_fns::time_entries::commands::tests::guards::delegated_stop_requires_restored_tracking_but_owner_keeps_terminal_recovery ... ok1398test server_fns::reports::tests::report_uses_current_active_actor_and_tenant_for_every_filter ... ok1399test server_fns::time_entries::commands::tests::guards::no_op_emits_no_effects_and_changed_payload_uses_normalized_effective_values ... ok1400test server_fns::time_entries::commands::tests::guards::project_management_covers_only_its_project_and_checks_both_move_ends ... ok1401test server_fns::time_entries::commands::tests::guards::task_grants_archives_and_canonical_admin_role_do_not_bypass_tracking ... ok1402test server_fns::time_entries::tests::a_limit_bounds_a_listing_on_its_own ... ok1403test server_fns::time_entries::commands::tests::revocation::cancelling_waiting_command_releases_authority_and_subject_barriers ... ok1404test server_fns::time_entries::commands::tests::revocation::admitted_delegated_stop_finishes_before_assignment_revocation ... ok1405test server_fns::reports::tests::same_names_keep_separate_groups_for_every_dimension ... ok1406test server_fns::time_entries::commands::tests::tracking_is_subject_eligible_and_actor_writable_without_financial_fields ... ok1407test server_fns::time_entries::tests::an_unlimited_listing_needs_both_ends_of_the_range ... ok1408test server_fns::time_entries::tests::a_reorder_rejects_foreign_missing_timed_and_duplicate_ids ... ok1409test server_fns::time_entries::tests::clamps_duration_against_the_snapped_start ... ok1410test server_fns::time_entries::commands::tests::revocation::delegated_stop_waits_for_revocation_and_observes_commit_or_rollback ... ok1411test server_fns::time_entries::tests::a_running_timer_cannot_be_moved_to_another_day ... ok1412test server_fns::time_entries::tests::admin_may_log_time_without_assignment ... ok1413test server_fns::time_entries::tests::an_open_entry_can_move_into_a_day_with_locked_time ... ok1414test server_fns::reports::tests::shared_person_and_task_are_partitioned_by_currency ... ok1415test server_fns::time_entries::tests::assigned_member_may_log_time ... ok1416test server_fns::time_entries::tests::concurrent_timer_starts_insert_exactly_one_entry ... ok1417test server_fns::time_entries::tests::rejects_out_of_range_start ... ok1418test server_fns::time_entries::tests::snaps_unaligned_start_to_the_grid ... ok1419test server_fns::time_entries::tests::edits_preserve_archived_time_but_cannot_override_non_billability ... ok1420test server_fns::time_entries::tests::inactive_project_cannot_accept_new_time_even_for_admin ... ok1421test server_fns::time_entries::tests::moving_locked_time_rejects_the_entire_reorder ... ok1422test server_fns::time_entries::tests::untimed_start_is_left_untouched ... ok1423test server_fns::time_entries::tests::new_time_and_picker_reject_inactive_or_foreign_contexts ... ok1424test server_fns::time_entries::tests::new_time_and_picker_require_a_project_task_link ... ok1425test server_fns::time_entries::tests::submission_barrier_blocks_manual_entries_and_timer_starts ... ok1426test server_fns::time_entries::tests::submission_barrier_blocks_edits_and_cross_week_reorders ... ok1427test server_fns::reports::tests::tag_filters_keep_report_dimensions_and_details_in_sync ... ok1428test server_fns::time_entries::tests::unassigned_member_is_forbidden ... ok1429test server_fns::time_entries::tests::new_time_uses_effective_billability_for_manual_entries_and_timers ... ok1430test server_fns::time_entries::update_tests::competing_identical_edit_is_a_noop_after_the_first_commit ... ok1431test server_fns::time_entries::update_tests::competing_edit_that_restores_old_values_still_reports_a_change ... ok1432test server_fns::time_entries::update_tests::effective_billability_noop_preserves_the_row ... ok1433test server_fns::time_entries::update_tests::each_editable_field_changes_once_including_nulls ... ok1434test server_fns::time_entries::update_tests::concurrent_lock_or_delete_is_rechecked_before_editing ... ok1435test server_fns::time_entries::update_tests::assignment_cascade_allows_an_inflight_entry_project_fk_to_finish ... ok1436test server_fns::time_entries::update_tests::missing_foreign_and_locked_entries_are_not_noops ... ok1437test server_fns::time_entries::update_tests::normalized_noop_preserves_the_row_and_updated_at ... ok1438test server_fns::time_entries::update_tests::restricted_empty_task_rejects_changes_and_noop_edits ... ok1439test server_fns::time_entries::update_tests::restricted_empty_task_rejects_picker_manual_and_timer_starts ... ok1440test server_fns::time_entries::update_tests::restricted_reordering_rejects_the_whole_batch ... ok1441test server_fns::time_entries::update_tests::revoked_grant_does_not_trap_an_own_running_timer ... ok1442test server_fns::time_entries::update_tests::revoked_timer_stop_preserves_the_open_state_guard ... ok1443test server_fns::time_entries::update_tests::restricted_task_rejects_reschedule_and_delete ... ok1444test server_fns::time_entries::update_tests::restriction_changes_are_rechecked_before_manual_or_timer_insertion ... ok1445test server_fns::time_entries::update_tests::task_grant_revocation_committed_during_an_edit_is_rechecked ... ok1446test server_fns::users::tests::authority::access_transaction_holds_actor_authority_until_commit ... ok1447test server_fns::time_entries::update_tests::task_grants_allow_tracking_and_archived_history_for_every_role ... ok1448test server_fns::users::tests::authority::active_administrator_can_create_change_roles_and_deactivate ... ok1449test server_fns::users::tests::concurrency::access_changes_cannot_target_another_organization ... ok1450test server_fns::users::tests::concurrency::concurrent_demotions_keep_an_active_admin ... ok1451test server_fns::users::tests::authority::duplicate_creation_rolls_back_and_leaves_access_changes_usable ... ok1452test server_fns::users::tests::concurrency::concurrent_deactivations_keep_an_active_admin ... ok1453test server_fns::users::tests::concurrency::deactivation_and_demotion_keep_an_active_admin ... ok1454test server_fns::users::tests::concurrency::the_last_admin_cannot_be_demoted_or_deactivated ... ok1455test server_fns::users::tests::hide_rates_clears_both_rate_fields ... ok1456test server_fns::users::tests::concurrency::demotion_and_deactivation_keep_an_active_admin ... ok1457test server_fns::users::tests::authority::user_mutations_wait_for_actor_revocation_and_recheck_after_commit ... ok1458test server_fns::users::tests::concurrency::unchanged_admin_access_is_allowed ... ok1459test server_fns::users::tests::authority::foreign_and_unknown_actors_cannot_change_local_user_access ... ok1460test server_fns::users::tests::authority::project_editor_and_user_revocation_commit_in_gate_order ... ok1461test server_fns::users::tests::authority::revoked_administrator_cannot_create_change_roles_or_deactivate ... ok1462test server_fns::users::tests::authority::user_mutations_recheck_revocation_after_waiting_for_organization_lock ... ok14631464failures:14651466---- server_fns::permissions::project_management_tests::legacy_project_lock_returns_busy_instead_of_forming_an_org_fk_cycle stdout ----14671468thread 'server_fns::permissions::project_management_tests::legacy_project_lock_returns_busy_instead_of_forming_an_org_fk_cycle' (6406) panicked at crates/horae/src/server_fns/permissions/tests/project_management.rs:797:5:1469Ok(ProjectManagersOutcome { project_id: 01a114fc-335c-7de2-b7fe-1355d9026669, access_revision: 1, changed: true })147014711472failures:1473 server_fns::permissions::project_management_tests::legacy_project_lock_returns_busy_instead_of_forming_an_org_fk_cycle14741475test result: FAILED. 1031 passed; 1 failed; 11 ignored; 0 measured; 0 filtered out; finished in 188.64s14761477error: test failed, to rerun pass `-p horae --bin horae`