failed attributes
| status |
attribute |
duration |
| failed |
checks.aarch64-darwin.e2e
|
7m 37s |
setup:
these 3 derivations will be built:
/nix/store/87nybsn6l8rjd5pk21d17jbcmlr5xwzf-driverConfiguration.json.drv
/nix/store/038r9hg10w4vklaknwgff68bggajym …
setup:
these 3 derivations will be built:
/nix/store/87nybsn6l8rjd5pk21d17jbcmlr5xwzf-driverConfiguration.json.drv
/nix/store/038r9hg10w4vklaknwgff68bggajymwi-nixos-test-driver-horae-e2e.drv
/nix/store/y43yhc4bl7cjwyd8w2dbwd8x3c8n36bc-vm-test-run-horae-e2e.drv
cannot build on 'grpc://farm.numtide.com:50051?client-cert=/run/secrets/vars/per-machine/bld1/nix-farm-ci/crt&client-key=/run/secrets/vars/per-machine/bld1/nix-farm-ci/key&connect-timeout=20&system=aarch64-darwin': error: gRPC StoreInfo on 'farm.numtide.com:50051' failed: failed to connect to all addresses; last error: UNKNOWN: ipv4:65.21.215.17:50051: handshaker shutdown
hint: Set NIX_GRPC_DEBUG=1 for a handshake trace.
Failed to find a machine for remote build!
derivation: y43yhc4bl7cjwyd8w2dbwd8x3c8n36bc-vm-test-run-horae-e2e.drv
required (system, features): (aarch64-darwin, [apple-virt, nixos-test])
12 available machines:
(systems, maxjobs, supportedFeatures, mandatoryFeatures)
([aarch64-darwin], 8, [big-parallel, kvm, nixos-test, uid-range], [])
([aarch64-darwin], 8, [big-parallel, kvm, nixos-test, uid-range], [])
([aarch64-darwin], 8, [big-parallel, kvm, nixos-test, uid-range], [])
([aarch64-darwin], 8, [big-parallel, kvm, nixos-test, uid-range], [])
([aarch64-linux], 8, [big-parallel, kvm, nixos-test, uid-range], [])
([aarch64-linux], 8, [big-parallel…
error: Cannot build '/nix/store/y43yhc4bl7cjwyd8w2dbwd8x3c8n36bc-vm-test-run-horae-e2e.drv'.
Reason: platform mismatch
Required system: 'aarch64-darwin'
Current system: 'x86_64-linux'
Reason: missing system features
Required features: {apple-virt, nixos-test}
Available features: {benchmark, big-parallel, ca-derivations, kvm, nixos-test, recursive-nix, uid-range}
|
| failed |
checks.aarch64-darwin.e2e-oidc
|
7m 28s |
setup:
these 3 derivations will be built:
/nix/store/1n1f7nv45g3vxcsp1wmvnpjdlxrpj95a-driverConfiguration.json.drv
/nix/store/26v7zfks25xiwvm4sb0gzc4fk5g2sn …
setup:
these 3 derivations will be built:
/nix/store/1n1f7nv45g3vxcsp1wmvnpjdlxrpj95a-driverConfiguration.json.drv
/nix/store/26v7zfks25xiwvm4sb0gzc4fk5g2sn4m-nixos-test-driver-horae-e2e-oidc.drv
/nix/store/a7rvf8zn0bwnf418bszxf2rydqncaanz-vm-test-run-horae-e2e-oidc.drv
farm.numtide.com:50051: failed to connect to all addresses; last error: UNKNOWN: ipv4:65.21.215.17:50051: tcp handshaker shutdown, retrying
Failed to find a machine for remote build!
derivation: a7rvf8zn0bwnf418bszxf2rydqncaanz-vm-test-run-horae-e2e-oidc.drv
required (system, features): (aarch64-darwin, [apple-virt, nixos-test])
12 available machines:
(systems, maxjobs, supportedFeatures, mandatoryFeatures)
([aarch64-darwin], 8, [big-parallel, kvm, nixos-test, uid-range], [])
([aarch64-darwin], 8, [big-parallel, kvm, nixos-test, uid-range], [])
([aarch64-darwin], 8, [big-parallel, kvm, nixos-test, uid-range], [])
([aarch64-darwin], 8, [big-parallel, kvm, nixos-test, uid-range], [])
([aarch64-linux], 8, [big-parallel, kvm, nixos-test, uid-range], [])
([aarch64-linux], 8, [big-par…
error: Cannot build '/nix/store/a7rvf8zn0bwnf418bszxf2rydqncaanz-vm-test-run-horae-e2e-oidc.drv'.
Reason: platform mismatch
Required system: 'aarch64-darwin'
Current system: 'x86_64-linux'
Reason: missing system features
Required features: {apple-virt, nixos-test}
Available features: {benchmark, big-parallel, ca-derivations, kvm, nixos-test, recursive-nix, uid-range}
|
| failed |
checks.aarch64-darwin.tests
|
10m 6s |
horae-tests-0.1.0:
---- reports::streaming::database_tests::authorization::streamed_cancelled_fetch_reclaims_connection_without_authority_locks stdout ----
thre …
horae-tests-0.1.0:
---- reports::streaming::database_tests::authorization::streamed_cancelled_fetch_reclaims_connection_without_authority_locks stdout ----
thread 'reports::streaming::database_tests::authorization::streamed_cancelled_fetch_reclaims_connection_without_authority_locks' (90923215) panicked at crates/horae/src/reports/streaming/database_tests/authorization.rs:682:6:
cancelled export must close its connection: Elapsed(())
failures:
reports::streaming::database_tests::authorization::streamed_cancelled_authorization_reclaims_its_single_connection
reports::streaming::database_tests::authorization::streamed_cancelled_fetch_reclaims_connection_without_authority_locks
test result: FAILED. 903 passed; 2 failed; 10 ignored; 0 measured; 0 filtered out; finished in 112.39s
error: test failed, to rerun pass `-p horae --bin horae`
|
| failed |
checks.aarch64-linux.e2e
|
5m 5s |
vm-test-run-horae-e2e:
)
^
File "/nix/store/yv2q67grjgrymd498bgdfzlhyaj04cqv-nixos-test-driver-1.1/lib/python3.13/site-packages/test_driver/machine/__ …
vm-test-run-horae-e2e:
)
^
File "/nix/store/yv2q67grjgrymd498bgdfzlhyaj04cqv-nixos-test-driver-1.1/lib/python3.13/site-packages/test_driver/machine/__init__.py", line 878, in _execute
self.connect()
~~~~~~~~~~~~^^
File "/nix/store/yv2q67grjgrymd498bgdfzlhyaj04cqv-nixos-test-driver-1.1/lib/python3.13/site-packages/test_driver/machine/__init__.py", line 1057, in connect
raise RuntimeError("Shell did not start in time")
RuntimeError: Shell did not start in time
|
| failed |
checks.aarch64-linux.e2e-oidc
|
5m 8s |
vm-test-run-horae-e2e-oidc:
)
^
File "/nix/store/yv2q67grjgrymd498bgdfzlhyaj04cqv-nixos-test-driver-1.1/lib/python3.13/site-packages/test_driver/machi …
vm-test-run-horae-e2e-oidc:
)
^
File "/nix/store/yv2q67grjgrymd498bgdfzlhyaj04cqv-nixos-test-driver-1.1/lib/python3.13/site-packages/test_driver/machine/__init__.py", line 878, in _execute
self.connect()
~~~~~~~~~~~~^^
File "/nix/store/yv2q67grjgrymd498bgdfzlhyaj04cqv-nixos-test-driver-1.1/lib/python3.13/site-packages/test_driver/machine/__init__.py", line 1057, in connect
raise RuntimeError("Shell did not start in time")
RuntimeError: Shell did not start in time
|