horae-tests-0.1.0
checks.aarch64-darwin.tests
· build #101
· raw
1mac02: building 36w6spzfkfi8dwfq6apfbrif1xbj1dah-horae-tests-0.1.0.drv
unpackPhase
2unpacking source archive /nix/store/bk6ijw44kpphrg8w2zhni2xr2yhy9921-source3source root is source4Executing cargoSetupPostUnpackHook5Finished cargoSetupPostUnpackHookpatchPhase
6Executing cargoSetupPostPatchHook7Validating consistency between /nix/var/nix/builds/nix-54963-284930785/source/Cargo.lock and /nix/var/nix/builds/nix-54963-284930785/cargo-vendor-dir/Cargo.lock8Finished cargoSetupPostPatchHookbuildPhase
9 Compiling proc-macro2 v1.0.10610 Compiling quote v1.0.4611 Compiling unicode-ident v1.0.2412 Compiling serde_core v1.0.22813 Compiling autocfg v1.5.114 Compiling serde v1.0.22815 Compiling thiserror v2.0.1816 Compiling core-foundation-sys v0.8.717 Compiling iana-time-zone v0.1.6518 Compiling num-traits v0.2.1919 Compiling syn v2.0.11820 Compiling serde_derive v1.0.22821 Compiling thiserror-impl v2.0.1822 Compiling uuid v1.23.423 Compiling chrono v0.4.4524 Compiling horae-core v0.1.0 (/nix/var/nix/builds/nix-54963-284930785/source/crates/core)25 Finished `test` profile [unoptimized + debuginfo] target(s) in 4.19s26------------27 Nextest run ID 258f2e10-39a3-47cc-93ad-fbcb98d9721a with nextest profile: default28 Starting 160 tests across 1 binary29 Running [ 00:00:00] 0/160: 10 running, 0 passed, 0 skipped 30 [ 00:00:00] horae-core ed_alert_threshold_is_exact_without_rounding31 [ 00:00:00] horae-core ert_accepts_zero_percent_but_not_zero_budget32 [ 00:00:00] horae-core jects_invalid_inputs_and_widens_large_values33 [ 00:00:00] horae-core percentage_rounds_clamps_and_never_overflows34 [ 00:00:00] horae-core ::a_single_jump_announces_every_crossed_band35 [ 00:00:00] horae-core ::tests::current_band_is_the_highest_reached36 [ 00:00:00] horae-core dget::tests::each_crossing_is_announced_once37 [ 00:00:00] horae-core elow_a_band_does_not_fire_but_current_resets38 Running [ 00:00:00] => 20/160: 10 running, 20 passed, 0 skipped 39 [ 00:00:00] horae-core ::tests::minutes_between_is_exact_no_minimum40 [ 00:00:00] horae-core duration::tests::parse_colon41 [ 00:00:00] horae-core duration::tests::parse_decimal42 [ 00:00:00] horae-core se_preserves_u32_boundary_without_saturating43 [ 00:00:00] horae-core s::parse_decimal_rounds_half_minutes_exactly44 [ 00:00:00] horae-core rse_rejects_colon_overflow_without_panicking45 [ 00:00:00] horae-core ts_excessive_decimal_precision_and_numerator46 [ 00:00:00] horae-core cts_negative_non_finite_and_malformed_values47 PASS [ 0.025s] horae-core budget::tests::display_percentage_rounds_clamps_and_never_overflows48 PASS [ 0.025s] horae-core budget::tests::configured_alert_threshold_is_exact_without_rounding49 PASS [ 0.025s] horae-core budget::tests::drop_below_a_band_does_not_fire_but_current_resets50 PASS [ 0.025s] horae-core budget::tests::each_crossing_is_announced_once51 PASS [ 0.026s] horae-core budget::tests::configured_alert_accepts_zero_percent_but_not_zero_budget52 PASS [ 0.025s] horae-core budget::tests::current_band_is_the_highest_reached53 PASS [ 0.025s] horae-core budget::tests::no_band_for_zero_or_missing_budget54 PASS [ 0.026s] horae-core budget::tests::large_values_do_not_overflow55 PASS [ 0.026s] horae-core budget::tests::configured_alert_rejects_invalid_inputs_and_widens_large_values56 PASS [ 0.027s] horae-core budget::tests::a_single_jump_announces_every_crossed_band57 PASS [ 0.014s] horae-core budget::tests::over_budget_fires_even_without_a_configured_100_band58 PASS [ 0.014s] horae-core duration::tests::format_clamps_negative_to_zero59 PASS [ 0.014s] horae-core duration::tests::format_hhmm_pads_minutes60 PASS [ 0.013s] horae-core duration::tests::format_round_trip61 PASS [ 0.014s] horae-core client::tests::profile_rejects_unsupported_currency_and_null_billing_fields62 PASS [ 0.014s] horae-core client::tests::optional_text_normalizes_only_blank_fields63 PASS [ 0.014s] horae-core client::tests::profile_rejects_blank_overlong_and_null_names64 PASS [ 0.014s] horae-core client::tests::default_rate_preserves_absence_zero_and_exact_large_amounts65 PASS [ 0.014s] horae-core client::tests::default_rate_rejects_negative_fractional_cent_overflow_and_invalid_text66 PASS [ 0.015s] horae-core client::tests::profile_accepts_supported_currencies_and_unicode_character_limit67 Running [ 00:00:00] => 20/160: 10 running, 20 passed, 0 skipped 68 [ 00:00:00] horae-core ::tests::minutes_between_is_exact_no_minimum69 [ 00:00:00] horae-core duration::tests::parse_colon70 [ 00:00:00] horae-core duration::tests::parse_decimal71 [ 00:00:00] horae-core se_preserves_u32_boundary_without_saturating72 [ 00:00:00] horae-core s::parse_decimal_rounds_half_minutes_exactly73 [ 00:00:00] horae-core rse_rejects_colon_overflow_without_panicking74 [ 00:00:00] horae-core ts_excessive_decimal_precision_and_numerator75 [ 00:00:00] horae-core cts_negative_non_finite_and_malformed_values76 Running [ 00:00:00] ===> 70/160: 10 running, 20 passed, 0 skipped 77 [ 00:00:00] horae-core ::tests::minutes_between_is_exact_no_minimum78 [ 00:00:00] horae-core duration::tests::parse_colon79 [ 00:00:00] horae-core duration::tests::parse_decimal80 [ 00:00:00] horae-core se_preserves_u32_boundary_without_saturating81 [ 00:00:00] horae-core s::parse_decimal_rounds_half_minutes_exactly82 [ 00:00:00] horae-core rse_rejects_colon_overflow_without_panicking83 [ 00:00:00] horae-core ts_excessive_decimal_precision_and_numerator84 [ 00:00:00] horae-core cts_negative_non_finite_and_malformed_values85 PASS [ 0.011s] horae-core duration::tests::parse_rejects_colon_overflow_without_panicking86 PASS [ 0.011s] horae-core duration::tests::minutes_between_is_exact_no_minimum87 PASS [ 0.011s] horae-core duration::tests::parse_decimal_rounds_half_minutes_exactly88 PASS [ 0.011s] horae-core duration::tests::parse_preserves_u32_boundary_without_saturating89 PASS [ 0.011s] horae-core importers::harvest::convert::tests::conversion_handles_high_precision_without_intermediate_overflow90 PASS [ 0.011s] horae-core duration::tests::parse_rejects_negative_non_finite_and_malformed_values91 PASS [ 0.012s] horae-core duration::tests::parse_rejects_excessive_decimal_precision_and_numerator92 PASS [ 0.012s] horae-core duration::tests::parse_decimal93 PASS [ 0.012s] horae-core duration::tests::parse_colon94 PASS [ 0.014s] horae-core duration::tests::parse_round_trips_each_minute_in_a_day95 PASS [ 0.009s] horae-core importers::harvest::convert::tests::conversion_rejects_unrepresentable_scaled_values_without_panicking96 PASS [ 0.009s] horae-core importers::harvest::convert::tests::hours_common_values_are_exact97 PASS [ 0.010s] horae-core importers::harvest::convert::tests::conversion_preserves_the_i64_boundary_and_rejects_rounding_past_it98 PASS [ 0.010s] horae-core importers::harvest::convert::tests::conversion_reports_precision_and_numerator_limits99 PASS [ 0.010s] horae-core importers::harvest::convert::tests::garbage_is_rejected100 PASS [ 0.010s] horae-core importers::harvest::convert::tests::high_precision_fraction_straddles_the_half_minute_exactly101 PASS [ 0.011s] horae-core importers::harvest::convert::tests::leading_and_trailing_forms_parse102 PASS [ 0.010s] horae-core importers::harvest::convert::tests::money_common_values_are_exact103 PASS [ 0.016s] horae-core importers::harvest::convert::tests::hours_round_trip_against_exporter_transform104 PASS [ 0.007s] horae-core importers::harvest::keys::tests::composite_components_do_not_collide105 PASS [ 0.008s] horae-core importers::harvest::convert::tests::money_rounds_third_decimal_half_up106 PASS [ 0.010s] horae-core importers::harvest::convert::tests::money_round_trip_against_exporter_transform107 PASS [ 0.007s] horae-core importers::harvest::keys::tests::normalize_matches_sql_harvest_norm_contract108 PASS [ 0.010s] horae-core importers::harvest::keys::tests::client_key_equal_across_case_and_whitespace109 PASS [ 0.011s] horae-core importers::harvest::convert::tests::negative_is_rejected110 PASS [ 0.011s] horae-core importers::harvest::convert::tests::round_half_up_at_the_boundary111 Running [ 00:00:00] ===> 72/160: 10 running, 72 passed, 0 skipped 112 [ 00:00:00] horae-core s::conversion_matches_exact_scaled_rationals113 [ 00:00:00] horae-core :line_amount_rejects_unrepresentable_results114 [ 00:00:00] horae-core line_amount_rounds_half_cents_up_not_to_even115 [ 00:00:00] horae-core invoice::tests::line_amount_zero_minutes116 [ 00:00:00] horae-core invoice::tests::line_amount_zero_rate117 [ 00:00:00] horae-core invoice::tests::resolve_rate_cascade118 [ 00:00:00] horae-core keeps_zero_and_explicit_missing_project_rate119 [ 00:00:00] horae-core ed_rate_mode_ignores_unselected_rate_sources120 PASS [ 0.007s] horae-core importers::harvest::keys::tests::occurrence_counter_keys_are_independent121 PASS [ 0.013s] horae-core importers::harvest::keys::tests::normalize_trims_and_case_folds122 PASS [ 0.008s] horae-core importers::harvest::keys::tests::project_key_falls_back_to_client_and_name123 PASS [ 0.009s] horae-core importers::harvest::keys::tests::occurrence_counter_numbers_repeats_from_zero124 PASS [ 0.006s] horae-core importers::harvest::types::tests::archived_errors_and_new_inline_errors_reconcile_across_batches125 PASS [ 0.008s] horae-core importers::harvest::keys::tests::task_key_shared_across_projects126 PASS [ 0.009s] horae-core importers::harvest::keys::tests::project_key_prefers_code_when_present127 PASS [ 0.009s] horae-core importers::harvest::keys::tests::time_entry_key_distinguishes_and_matches128 PASS [ 0.009s] horae-core importers::harvest::types::account_switch_tests::account_switch_requires_binding_and_no_imports_or_active_work129 PASS [ 0.010s] horae-core importers::harvest::types::tests::does_not_reconcile_when_an_errored_count_has_no_reported_error130 PASS [ 0.006s] horae-core invoice::tests::discount_allocation_rejects_negative_lines_and_subtotal_overflow131 PASS [ 0.008s] horae-core importers::harvest::types::tests::import_modes_display_their_wire_names132 PASS [ 0.008s] horae-core invoice::tests::discount_allocation_handles_empty_zero_and_full_discounts133 PASS [ 0.010s] horae-core invoice::tests::discount_allocation_conserves_header_amount_and_bounds_each_line134 PASS [ 0.009s] horae-core invoice::tests::discount_allocation_supports_maximum_representable_subtotal135 PASS [ 0.009s] horae-core invoice::tests::discount_allocation_uses_largest_remainder_then_stable_source_order136 PASS [ 0.013s] horae-core importers::harvest::types::tests::reconciles_when_errored_counts_match_collected_errors137 PASS [ 0.007s] horae-core invoice::tests::invoice_adjustments_apply_discount_before_non_compounding_taxes138 PASS [ 0.012s] horae-core invoice::tests::discounted_fee_contribution_leaves_discount_available139 PASS [ 0.006s] horae-core invoice::tests::line_amount_half_hour140 PASS [ 0.010s] horae-core invoice::tests::invoice_adjustments_reject_negative_subtotal_and_overflow141 PASS [ 0.008s] horae-core invoice::tests::line_amount_90_minutes142 PASS [ 0.010s] horae-core invoice::tests::invoice_adjustments_round_components_half_up143 PASS [ 0.009s] horae-core invoice::tests::line_amount_exact_hour144 PASS [ 0.010s] horae-core invoice::tests::line_amount_accepts_large_representable_amounts145 Running [ 00:00:00] ===> 72/160: 10 running, 72 passed, 0 skipped 146 [ 00:00:00] horae-core s::conversion_matches_exact_scaled_rationals147 [ 00:00:00] horae-core :line_amount_rejects_unrepresentable_results148 [ 00:00:00] horae-core line_amount_rounds_half_cents_up_not_to_even149 [ 00:00:00] horae-core invoice::tests::line_amount_zero_minutes150 [ 00:00:00] horae-core invoice::tests::line_amount_zero_rate151 [ 00:00:00] horae-core invoice::tests::resolve_rate_cascade152 [ 00:00:00] horae-core keeps_zero_and_explicit_missing_project_rate153 [ 00:00:00] horae-core ed_rate_mode_ignores_unselected_rate_sources154 PASS [ 0.009s] horae-core invoice::tests::line_amount_odd_minutes155 Running [ 00:00:00] ===> 72/160: 10 running, 72 passed, 0 skipped 156 [ 00:00:00] horae-core s::conversion_matches_exact_scaled_rationals157 [ 00:00:00] horae-core :line_amount_rejects_unrepresentable_results158 [ 00:00:00] horae-core line_amount_rounds_half_cents_up_not_to_even159 [ 00:00:00] horae-core invoice::tests::line_amount_zero_minutes160 [ 00:00:00] horae-core invoice::tests::line_amount_zero_rate161 [ 00:00:00] horae-core invoice::tests::resolve_rate_cascade162 [ 00:00:00] horae-core keeps_zero_and_explicit_missing_project_rate163 [ 00:00:00] horae-core ed_rate_mode_ignores_unselected_rate_sources164 Running [ 00:00:00] ======> 121/160: 10 running, 72 passed, 0 skipped 165 [ 00:00:00] horae-core s::conversion_matches_exact_scaled_rationals166 [ 00:00:00] horae-core :line_amount_rejects_unrepresentable_results167 [ 00:00:00] horae-core line_amount_rounds_half_cents_up_not_to_even168 [ 00:00:00] horae-core invoice::tests::line_amount_zero_minutes169 [ 00:00:00] horae-core invoice::tests::line_amount_zero_rate170 [ 00:00:00] horae-core invoice::tests::resolve_rate_cascade171 [ 00:00:00] horae-core keeps_zero_and_explicit_missing_project_rate172 [ 00:00:00] horae-core ed_rate_mode_ignores_unselected_rate_sources173 PASS [ 0.007s] horae-core invoice::tests::selected_rate_keeps_zero_and_explicit_missing_project_rate174 PASS [ 0.009s] horae-core invoice::tests::line_amount_rounds_half_cents_up_not_to_even175 PASS [ 0.011s] horae-core invoice::tests::line_amount_rejects_unrepresentable_results176 PASS [ 0.008s] horae-core invoice::tests::line_amount_zero_minutes177 PASS [ 0.007s] horae-core invoice::tests::resolve_rate_cascade178 PASS [ 0.008s] horae-core invoice::tests::selected_rate_mode_ignores_unselected_rate_sources179 PASS [ 0.054s] horae-core importers::harvest::convert::tests::conversion_matches_exact_scaled_rationals180 PASS [ 0.012s] horae-core invoice::tests::line_amount_zero_rate181 PASS [ 0.009s] horae-core money::tests::addition_retains_currency_checks_and_representable_boundaries182 PASS [ 0.006s] horae-core money::tests::format_cents_groups_thousands_and_keeps_sign183 PASS [ 0.006s] horae-core money::tests::parse_cents_rejects_what_it_cannot_represent184 PASS [ 0.011s] horae-core money::tests::addition_rejects_overflow_in_both_directions185 PASS [ 0.009s] horae-core money::tests::format_cents_plain_keeps_sign_below_one_unit186 PASS [ 0.008s] horae-core money::tests::parse_cents_tolerates_grouping_spaces_and_signs187 PASS [ 0.006s] horae-core permissions::catalog::stored_tests::rejects_each_missing_floor_grant188 PASS [ 0.012s] horae-core money::tests::parse_cents_reads_whole_and_fractional_amounts189 PASS [ 0.006s] horae-core permissions::catalog::stored_tests::rejects_every_missing_prerequisite_without_repairing_input190 PASS [ 0.013s] horae-core money::tests::parse_cents_is_exact_where_a_float_would_drift191 PASS [ 0.007s] horae-core permissions::catalog::stored_tests::restores_custom_selection_without_reapplying_profile_defaults192 PASS [ 0.011s] horae-core permissions::catalog::stored_tests::rejects_duplicate_grants_instead_of_silently_deduplicating193 PASS [ 0.007s] horae-core permissions::catalog::stored_tests::rejects_unsupported_versions_even_for_valid_grants194 PASS [ 0.011s] horae-core permissions::catalog::stored_tests::rejects_empty_saved_selection_instead_of_adding_member_floor195 PASS [ 0.006s] horae-core permissions::catalog::tests::adding_all_catalog_grants_produces_exactly_the_catalog196 PASS [ 0.011s] horae-core permissions::catalog::stored_tests::restores_each_builtin_selection_without_changing_grants197 PASS [ 0.008s] horae-core permissions::catalog::tests::administrator_selection_covers_known_catalog_without_unknown_ids198 Running [ 00:00:00] =====> 122/160: 10 running, 122 passed, 0 skipped 199 [ 00:00:00] horae-core mpotent_order_independent_and_duplicate_free200 [ 00:00:00] horae-core t_scope_and_missing_assignments_do_not_match201 [ 00:00:00] horae-core ontext_is_denied_for_every_scope_combination202 [ 00:00:00] horae-core ignment_removes_only_that_matching_dimension203 [ 00:00:00] horae-core rmissions::tests::scope_union_obeys_set_laws204 [ 00:00:00] horae-core cs_accept_same_day_but_reject_reversed_dates205 [ 00:00:00] horae-core cept_supported_currencies_and_optional_dates206 [ 00:00:00] horae-core ests::basics_reject_blank_and_overlong_names207 PASS [ 0.010s] horae-core permissions::catalog::stored_tests::stored_order_does_not_change_the_selected_set208 PASS [ 0.007s] horae-core permissions::catalog::tests::direct_profile_defaults_match_the_known_reference_catalog209 PASS [ 0.008s] horae-core permissions::catalog::tests::dependency_graph_matches_the_reference_edges_without_extra_cross_resource_grants210 PASS [ 0.009s] horae-core permissions::catalog::tests::catalog_has_fifty_distinct_known_grants211 PASS [ 0.011s] horae-core permissions::catalog::tests::approve_all_includes_read_scopes_but_not_write_or_expense_management212 PASS [ 0.006s] horae-core permissions::catalog::tests::every_profile_includes_floor_and_is_closed_under_dependencies213 PASS [ 0.006s] horae-core permissions::catalog::tests::floor_cannot_be_removed_or_partially_modified214 PASS [ 0.011s] horae-core permissions::catalog::tests::empty_selection_includes_member_floor215 PASS [ 0.010s] horae-core permissions::catalog::tests::every_declared_dependency_is_added_and_removing_it_removes_the_dependent216 PASS [ 0.010s] horae-core permissions::catalog::tests::finance_profiles_cannot_edit_rates_and_project_manager_has_no_financial_grants217 PASS [ 0.011s] horae-core permissions::catalog::tests::known_permission_name_decodes_without_legacy_role_conversion218 PASS [ 0.011s] horae-core permissions::catalog::tests::member_has_only_own_time_and_expense_access219 PASS [ 0.009s] horae-core permissions::catalog::tests::profiles_reject_legacy_rank_names_and_unknown_values220 PASS [ 0.009s] horae-core permissions::catalog::tests::removing_absent_permission_is_an_idempotent_no_op221 PASS [ 0.008s] horae-core permissions::catalog::tests::removing_invoice_draft_write_keeps_read_but_removes_managed_and_all_write222 PASS [ 0.009s] horae-core permissions::catalog::tests::removing_any_non_floor_grant_keeps_the_remaining_selection_closed223 PASS [ 0.010s] horae-core permissions::catalog::tests::removing_managed_time_read_also_removes_all_reads_writes_and_approvals224 PASS [ 0.009s] horae-core permissions::catalog::tests::removing_one_financial_permission_preserves_unrelated_families225 PASS [ 0.007s] horae-core permissions::catalog::tests::template_names_reject_empty_and_overlong_unicode_names226 PASS [ 0.006s] horae-core permissions::tests::assignment_matching_searches_all_members_and_is_insensitive_to_duplicates227 PASS [ 0.008s] horae-core permissions::catalog::tests::unknown_permission_names_are_rejected228 PASS [ 0.009s] horae-core permissions::catalog::tests::template_names_trim_without_changing_display_or_internal_spaces229 PASS [ 0.012s] horae-core permissions::catalog::tests::report_and_withdrawal_grants_do_not_add_unrelated_authority230 Running [ 00:00:00] =====> 122/160: 10 running, 122 passed, 0 skipped 231 [ 00:00:00] horae-core mpotent_order_independent_and_duplicate_free232 [ 00:00:00] horae-core t_scope_and_missing_assignments_do_not_match233 [ 00:00:00] horae-core ontext_is_denied_for_every_scope_combination234 [ 00:00:00] horae-core ignment_removes_only_that_matching_dimension235 [ 00:00:00] horae-core rmissions::tests::scope_union_obeys_set_laws236 [ 00:00:00] horae-core cs_accept_same_day_but_reject_reversed_dates237 [ 00:00:00] horae-core cept_supported_currencies_and_optional_dates238 [ 00:00:00] horae-core ests::basics_reject_blank_and_overlong_names239 PASS [ 0.034s] horae-core permissions::catalog::stored_tests::restores_each_valid_grant_pair_and_its_revoked_selection240 PASS [ 0.007s] horae-core permissions::tests::every_scope_combination_matches_only_explicitly_granted_dimensions241 Running [ 00:00:00] =====> 122/160: 10 running, 122 passed, 0 skipped 242 [ 00:00:00] horae-core mpotent_order_independent_and_duplicate_free243 [ 00:00:00] horae-core t_scope_and_missing_assignments_do_not_match244 [ 00:00:00] horae-core ontext_is_denied_for_every_scope_combination245 [ 00:00:00] horae-core ignment_removes_only_that_matching_dimension246 [ 00:00:00] horae-core rmissions::tests::scope_union_obeys_set_laws247 [ 00:00:00] horae-core cs_accept_same_day_but_reject_reversed_dates248 [ 00:00:00] horae-core cept_supported_currencies_and_optional_dates249 [ 00:00:00] horae-core ests::basics_reject_blank_and_overlong_names250 PASS [ 0.012s] horae-core permissions::tests::assignments_do_not_grant_scope_and_missing_assignments_do_not_match251 PASS [ 0.009s] horae-core permissions::tests::removing_an_assignment_removes_only_that_matching_dimension252 PASS [ 0.007s] horae-core project::tests::basics_accept_supported_currencies_and_optional_dates253 PASS [ 0.008s] horae-core project::tests::basics_accept_same_day_but_reject_reversed_dates254 PASS [ 0.012s] horae-core permissions::tests::inactive_or_foreign_context_is_denied_for_every_scope_combination255 PASS [ 0.007s] horae-core project::tests::basics_reject_overlong_code_and_unsupported_currency256 PASS [ 0.010s] horae-core permissions::tests::scope_union_obeys_set_laws257 PASS [ 0.009s] horae-core project::tests::basics_reject_blank_and_overlong_names258 PASS [ 0.010s] horae-core project::tests::fee_schedules_reject_missing_overlong_and_excessive_milestones259 PASS [ 0.006s] horae-core project::tests::monthly_fee_dates_follow_calendar_months260 PASS [ 0.006s] horae-core project::tests::fee_schedules_validate_amounts_and_milestone_total261 PASS [ 0.034s] horae-core permissions::catalog::tests::normalization_is_idempotent_order_independent_and_duplicate_free262 PASS [ 0.009s] horae-core project::tests::monetary_budgets_are_only_available_for_time_and_materials263 PASS [ 0.009s] horae-core project::tests::monthly_fee_dates_reject_invalid_calendar_inputs264 PASS [ 0.010s] horae-core project::tests::percentage_rejects_invalid_precision_range_and_syntax265 PASS [ 0.010s] horae-core project::tests::percentage_preserves_exact_hundredths266 PASS [ 0.011s] horae-core project::tests::payment_terms_support_receipt_and_checked_days267 PASS [ 0.006s] horae-core rounding::tests::nearest_ties_round_up268 PASS [ 0.006s] horae-core rounding::tests::up_and_down269 PASS [ 0.010s] horae-core rounding::tests::identity_when_inc_zero270 PASS [ 0.011s] horae-core rounding::tests::effective_minutes_respect_frozen_history_including_zero271 PASS [ 0.006s] horae-core time_of_day::tests::clamp_to_day_prevents_crossing_midnight272 PASS [ 0.006s] horae-core time_of_day::tests::format_12h_matches_harvest_style273 PASS [ 0.012s] horae-core rounding::tests::result_is_multiple_of_inc274 PASS [ 0.009s] horae-core state::tests::managers_invoice_open_and_approved_time275 PASS [ 0.010s] horae-core state::tests::invoiced_is_final276 PASS [ 0.007s] horae-core time_of_day::tests::format_round_trips277 Running [ 00:00:00] ======= 160/160: 10 running, 122 passed, 0 skipped 278 [ 00:00:00] horae-core mpotent_order_independent_and_duplicate_free279 [ 00:00:00] horae-core t_scope_and_missing_assignments_do_not_match280 [ 00:00:00] horae-core ontext_is_denied_for_every_scope_combination281 [ 00:00:00] horae-core ignment_removes_only_that_matching_dimension282 [ 00:00:00] horae-core rmissions::tests::scope_union_obeys_set_laws283 [ 00:00:00] horae-core cs_accept_same_day_but_reject_reversed_dates284 [ 00:00:00] horae-core cept_supported_currencies_and_optional_dates285 [ 00:00:00] horae-core ests::basics_reject_blank_and_overlong_names286 PASS [ 0.009s] horae-core state::tests::only_manager_can_approve287 PASS [ 0.013s] horae-core state::tests::member_submit_and_reopen288 PASS [ 0.006s] horae-core time_of_day::tests::snap_rounds_to_nearest_step289 PASS [ 0.009s] horae-core time_of_day::tests::parse_reads_12h_including_edges290 PASS [ 0.006s] horae-core week::tests::configured_week_contains_each_day_for_all_seven_start_days291 PASS [ 0.007s] horae-core types::tests::budget_kind_wire_strings_match_db_enum292 PASS [ 0.010s] horae-core time_of_day::tests::parse_reads_24h293 PASS [ 0.007s] horae-core week::tests::configured_week_reports_an_unrepresentable_start294 PASS [ 0.009s] horae-core week::tests::configured_week_can_start_in_the_previous_year295 PASS [ 0.010s] horae-core time_of_day::tests::parse_rejects_out_of_range_and_garbage296 PASS [ 0.007s] horae-core week::tests::maps_any_weekday_to_its_monday297------------298 Summary [ 0.182s] 160 tests run: 160 passed, 0 skipped299 Running [ 00:00:00] ======= 160/160: 10 running, 122 passed, 0 skipped 300 [ 00:00:00] horae-core mpotent_order_independent_and_duplicate_free301 [ 00:00:00] horae-core t_scope_and_missing_assignments_do_not_match302 [ 00:00:00] horae-core ontext_is_denied_for_every_scope_combination303 [ 00:00:00] horae-core ignment_removes_only_that_matching_dimension304 [ 00:00:00] horae-core rmissions::tests::scope_union_obeys_set_laws305 [ 00:00:00] horae-core cs_accept_same_day_but_reject_reversed_dates306 [ 00:00:00] horae-core cept_supported_currencies_and_optional_dates307 [ 00:00:00] horae-core ests::basics_reject_blank_and_overlong_names308The files belonging to this database system will be owned by user "_nixbld1".309This user must also own the server process.310311The database cluster will be initialized with locale "C".312The default text search configuration will be set to "english".313314Data page checksums are disabled.315316fixing permissions on existing directory /nix/var/nix/builds/nix-54963-284930785/tmp.VWFAwMIKkc ... ok317creating subdirectories ... ok318selecting dynamic shared memory implementation ... posix319selecting default "max_connections" ... 100320selecting default "shared_buffers" ... 128MB321selecting default time zone ... UTC322creating configuration files ... ok323running bootstrap script ... ok324performing post-bootstrap initialization ... ok325syncing data to disk ... ok326327initdb: warning: enabling "trust" authentication for local connections328initdb: hint: You can change this by editing pg_hba.conf or using the option -A, or --auth-local and --auth-host, the next time you run initdb.329330Success. You can now start the database server using:331332 pg_ctl -D /nix/var/nix/builds/nix-54963-284930785/tmp.VWFAwMIKkc -l logfile start333334waiting for server to start.... done335server started336 Compiling proc-macro2 v1.0.106337 Compiling unicode-ident v1.0.24338 Compiling serde v1.0.228339 Compiling serde_core v1.0.228340 Compiling cfg-if v1.0.4341 Compiling libc v0.2.186342 Compiling memchr v2.8.3343 Compiling version_check v0.9.5344 Compiling log v0.4.33345 Compiling libm v0.2.16346 Compiling itoa v1.0.18347 Compiling foldhash v0.2.0348 Compiling equivalent v1.0.2349 Compiling once_cell v1.21.4350 Compiling pin-project-lite v0.2.17351 Compiling typenum v1.20.1352 Compiling slab v0.4.12353 Compiling parking_lot_core v0.9.12354 Compiling scopeguard v1.2.0355 Compiling crossbeam-utils v0.8.22356 Compiling futures-core v0.3.32357 Compiling zeroize v1.9.0358 Compiling crossbeam-epoch v0.9.20359 Compiling crossbeam-deque v0.8.7360 Compiling quote v1.0.46361 Compiling syn v2.0.118362 Compiling hashbrown v0.17.1363 Compiling rayon-core v1.13.0364 Compiling bitflags v2.13.0365 Compiling getrandom v0.2.17366 Compiling futures-io v0.3.32367 Compiling rand_core v0.6.4368 Compiling futures-task v0.3.32369 Compiling num-traits v0.2.19370 Compiling futures-sink v0.3.32371 Compiling futures-channel v0.3.32372 Compiling generic-array v0.14.7373 Compiling zmij v1.0.21374 Compiling subtle v2.6.1375 Compiling allocator-api2 v0.2.21376 Compiling synstructure v0.13.2377 Compiling fnv v1.0.7378 Compiling stable_deref_trait v1.2.1379 Compiling crc32fast v1.5.0380 Compiling errno v0.3.14381 Compiling jobserver v0.1.35382 Compiling const-oid v0.9.6383 Compiling shlex v2.0.1384 Compiling base64 v0.22.1385 Compiling find-msvc-tools v0.1.9386 Compiling tracing-core v0.1.36387 Compiling cc v1.2.66388 Compiling zerocopy v0.8.53389 Compiling serde_derive v1.0.228390 Compiling thiserror-impl v2.0.18391 Compiling zerofrom-derive v0.1.7392 Compiling yoke-derive v0.8.2393 Compiling zerovec-derive v0.11.3394 Compiling displaydoc v0.2.6395 Compiling thiserror v2.0.18396 Compiling futures-macro v0.3.32397 Compiling zerofrom v0.1.8398 Compiling tracing-attributes v0.1.31399 Compiling futures-util v0.3.32400 Compiling zerocopy-derive v0.8.53401 Compiling crypto-common v0.1.7402 Compiling anyhow v1.0.103403 Compiling utf8_iter v1.0.4404 Compiling serde_json v1.0.150405 Compiling cobs v0.3.0406 Compiling rustc-hash v2.1.3407 Compiling percent-encoding v2.3.2408 Compiling block-buffer v0.10.4409 Compiling digest v0.10.7410 Compiling icu_normalizer_data v2.2.0411 Compiling tracing v0.1.44412 Compiling yoke v0.8.3413 Compiling icu_properties_data v2.2.0414 Compiling simd-adler32 v0.3.9415 Compiling writeable v0.6.3416 Compiling heck v0.5.0417 Compiling adler2 v2.0.1418 Compiling miniz_oxide v0.8.9419 Compiling smallvec v1.15.2420 Compiling lock_api v0.4.14421 Compiling either v1.16.0422 Compiling bytes v1.12.0423 Compiling postcard v1.1.3424 Compiling litemap v0.8.2425 Compiling rayon v1.12.0426 Compiling parking_lot v0.12.5427 Compiling zlib-rs v0.6.6428 Compiling tokio-macros v2.7.0429 Compiling signal-hook-registry v1.4.8430 Compiling zerovec v0.11.6431 Compiling socket2 v0.6.4432 Compiling mio v1.2.1433 Compiling http v1.4.2434 Compiling tokio v1.52.3435 Compiling bytemuck_derive v1.11.0436 Compiling cpufeatures v0.2.17437 Compiling utf16_iter v1.0.5438 Compiling write16 v1.0.0439 Compiling time-core v0.1.9440 Compiling num-conv v0.2.2441 Compiling powerfmt v0.2.0442 Compiling time-macros v0.2.31443 Compiling form_urlencoded v1.2.2444 Compiling ryu v1.0.23445 Compiling slotmap v1.1.1446 Compiling memmap2 v0.9.11447 Compiling indexmap v2.14.0448 Compiling rustversion v1.0.23449 Compiling bytemuck v1.25.1450 Compiling tinystr v0.8.3451 Compiling bumpalo v3.20.3452 Compiling zerotrie v0.2.4453 Compiling potential_utf v0.1.5454 Compiling deranged v0.5.8455 Compiling unicode-segmentation v1.13.3456 Compiling icu_collections v2.2.0457 Compiling winnow v0.7.15458 Compiling unicode-xid v0.2.6459 Compiling icu_locale_core v2.2.0460 Compiling httparse v1.10.1461 Compiling time v0.3.53462 Compiling arrayvec v0.7.8463 Compiling tinyvec_macros v0.1.1464 Compiling getrandom v0.4.3465 Compiling siphasher v1.0.3466 Compiling tinyvec v1.11.0467 Compiling ppv-lite86 v0.2.21468 Compiling flate2 v1.1.9469 Compiling icu_provider v2.2.0470 Compiling rand_chacha v0.3.1471 Compiling rand v0.8.6472 Compiling hashbrown v0.16.1473 Compiling semver v1.0.28474 Compiling icu_properties v2.2.0475 Compiling icu_normalizer v2.2.0476 Compiling spin v0.9.8477 Compiling fastrand v2.4.1478 Compiling polycool v0.4.0479 Compiling tokio-util v0.7.18480 Compiling kurbo v0.13.1481 Compiling unicode-properties v0.1.4482 Compiling tower-service v0.3.3483 Compiling ring v0.17.14484 Compiling aho-corasick v1.1.4485 Compiling mime v0.3.17486 Compiling wasmtime-internal-core v43.0.2487 Compiling regex-syntax v0.8.11488 Compiling idna_adapter v1.2.2489 Compiling unicode-bidi v0.3.18490 Compiling idna v1.1.0491 Compiling fearless_simd v0.4.1492 Compiling url v2.5.8493 Compiling unicode-normalization v0.1.25494 Compiling fdeflate v0.3.7495 Compiling zune-core v0.5.1496 Compiling png v0.18.1497 Compiling zune-jpeg v0.5.15498 Compiling http-body v1.0.1499 Compiling sha2 v0.10.9500 Compiling serde_path_to_error v0.1.20501 Compiling regex-automata v0.4.14502 Compiling untrusted v0.9.0503 Compiling cranelift-bitset v0.130.2504 Compiling half v2.7.1505 Compiling core_maths v0.1.1506 Compiling konst_macro_rules v0.2.19507 Compiling ipnet v2.12.0508 Compiling ciborium-io v0.2.2509 Compiling hayro-ccitt v0.3.0510 Compiling tower-layer v0.3.3511 Compiling ident_case v1.0.1512 Compiling konst v0.2.20513 Compiling ciborium-ll v0.2.2514 Compiling uuid v1.23.4515 Compiling const_format_proc_macros v0.2.34516 Compiling float-cmp v0.9.0517 Compiling hayro-jpeg2000 v0.3.5518 Compiling hayro-jbig2 v0.3.0519 Compiling num-integer v0.1.46520 Compiling target-lexicon v0.13.5521 Compiling proc-macro-hack v0.5.20+deprecated522 Compiling dioxus-core-types v0.7.9523 Compiling color_quant v1.1.0524 Compiling quick-error v2.0.1525 Compiling byteorder-lite v0.1.0526 Compiling getrandom v0.3.4527 Compiling unsafe-libyaml v0.2.11528 Compiling weezl v0.1.12529 Compiling hayro-syntax v0.7.2530 Compiling gif v0.14.2531 Compiling image-webp v0.2.4532 Compiling serde_yaml v0.9.34+deprecated533 Compiling const_format v0.2.36534 Compiling strict-num v0.1.1535 Compiling ciborium v0.2.2536 Compiling ttf-parser v0.25.1537 Compiling phf_shared v0.13.1538 Compiling euclid v0.22.14539 Compiling subsecond-types v0.7.9540 Compiling sync_wrapper v1.0.2541 Compiling libloading v0.8.9542 Compiling pxfm v0.1.30543 Compiling arrayref v0.3.9544 Compiling httpdate v1.0.3545 Compiling icu_locale_data v2.2.0546 Compiling unicode-script v0.5.8547 Compiling cranelift-srcgen v0.130.2548 Compiling cranelift-assembler-x64-meta v0.130.2549 Compiling tiny-skia-path v0.12.0550 Compiling subsecond v0.7.9551 Compiling phf_generator v0.13.1552 Compiling http-body-util v0.1.3553 Compiling unic-langid-impl v0.9.6554 Compiling font-types v0.11.3555 Compiling generational-box v0.7.9556 Compiling pin-project-internal v1.1.13557 Compiling async-trait v0.1.89558 Compiling encoding_rs v0.8.35559 Compiling thiserror v1.0.69560 Compiling rustix v1.1.4561 Compiling try-lock v0.2.5562 Compiling longest-increasing-subsequence v0.1.0563 Compiling unicode-bidi-mirroring v0.4.0564 Compiling same-file v1.0.6565 Compiling base64ct v1.8.3566 Compiling unicode-ccc v0.4.0567 Compiling walkdir v2.5.0568 Compiling rustybuzz v0.20.1569 Compiling pin-project v1.1.13570 Compiling dioxus-core v0.7.9571 Compiling want v0.3.1572 Compiling pem-rfc7468 v0.7.0573 Compiling moxcms v0.8.1574 Compiling read-fonts v0.39.2575 Compiling unic-langid-macros-impl v0.9.6576 Compiling rand_core v0.9.5577 Compiling phf_macros v0.13.1578 Compiling thiserror-impl v1.0.69579 Compiling pulley-macros v43.0.2580 Compiling rustls-pki-types v1.15.0581 Compiling xmlwriter v0.1.0582 Compiling wasm-bindgen-shared v0.2.126583 Compiling icu_collator_data v2.2.0584 Compiling imagesize v0.14.0585 Compiling bit-vec v0.8.0586 Compiling portable-atomic v1.13.1587 Compiling paste v1.0.15588 Compiling leb128fmt v0.1.0589 Compiling bit-set v0.8.0590 Compiling unic-langid-macros v0.9.6591 Compiling phf v0.13.1592 Compiling icu_locale v2.2.0593 Compiling rand_chacha v0.9.0594 Compiling der v0.7.10595 Compiling fontdb v0.23.0596 Compiling cranelift-entity v0.130.2597 Compiling svgtypes v0.16.1598 Compiling gimli v0.33.0599 Compiling core-foundation v0.9.4600 Compiling sha1 v0.10.6601 Compiling toml_datetime v0.6.11602 Compiling serde_spanned v0.6.9603 Compiling futures-executor v0.3.32604 Compiling strum_macros v0.27.2605 Compiling enum-ordinalize-derive v4.4.1606 Compiling comemo-macros v0.5.1607 Compiling wasmtime-internal-versioned-export-macros v43.0.2608 Compiling roxmltree v0.21.1609 Compiling quick-xml v0.41.0610 Compiling simplecss v0.2.2611 Compiling linked-hash-map v0.5.6612 Compiling cranelift-isle v0.130.2613 Compiling data-url v0.3.2614 Compiling unicode-vo v0.1.0615 Compiling wasmparser v0.239.0616 Compiling toml_write v0.1.2617 Compiling unscanny v0.1.0618 Compiling typst-utils v0.15.0619 Compiling pico-args v0.5.0620 Compiling toml_edit v0.22.27621 Compiling plist v1.10.0622 Compiling usvg v0.47.0623 Compiling yaml-rust v0.4.5624 Compiling comemo v0.5.1625 Compiling strum v0.27.2626 Compiling enum-ordinalize v4.4.1627 Compiling skrifa v0.42.1628 Compiling spki v0.7.3629 Compiling cranelift-bforest v0.130.2630 Compiling unic-langid v0.9.6631 Compiling rand v0.9.4632 Compiling image v0.25.10633 Compiling fancy-regex v0.16.2634 Compiling pulley-interpreter v43.0.2635 Compiling axum-core v0.5.6636 Compiling num-bigint v0.4.8637 Compiling wasmparser v0.245.1638 Compiling convert_case v0.8.0639 Compiling bincode v1.3.3640 Compiling quick-xml v0.38.4641 Compiling hmac v0.12.1642 Compiling warnings-macro v0.2.0643 Compiling wasmi_core v1.1.0644 Compiling codex v0.3.0645 Compiling rustls v0.23.41646 Compiling cranelift-codegen-shared v0.130.2647 Compiling by_address v1.2.1648 Compiling palette v0.7.6649 Compiling unicode-math-class v0.1.0650 Compiling roman-numerals-rs v3.1.0651 Compiling rust_decimal v1.42.1652 Compiling object v0.38.1653 Compiling data-encoding v2.11.0654 Compiling chinese-variant v1.1.6655 Compiling thin-vec v0.2.18656 Compiling wasmi_ir v1.1.0657 Compiling citationberg v0.7.0658 Compiling chinese-number v0.7.8659 Compiling biblatex v0.12.0660 Compiling warnings v0.2.1661 Compiling palette_derive v0.7.6662 Compiling cranelift-codegen-meta v0.130.2663 Compiling syntect v5.3.0664 Compiling icu_collator v2.2.1665 Compiling pkcs8 v0.10.2666 Compiling toml v0.8.23667 Compiling futures v0.3.32668 Compiling rustls-webpki v0.103.13669 Compiling cranelift-assembler-x64 v0.130.2670 Compiling darling_core v0.21.3671 Compiling typst-timing v0.15.0672 Compiling ecow v0.2.6673 Compiling approx v0.5.1674 Compiling csv-core v0.1.13675 Compiling proc-macro2-diagnostics v0.10.1676 Compiling io-lifetimes v2.0.4677 Compiling lazy-js-bundle v0.7.9678 Compiling mutate_once v0.1.2679 Compiling foldhash v0.1.5680 Compiling system-configuration-sys v0.6.0681 Compiling fast-srgb8 v1.0.0682 Compiling wasmi_collections v1.1.0683 Compiling atomic-waker v1.1.2684 Compiling parking v2.2.1685 Compiling cpp_demangle v0.4.5686 Compiling pkg-config v0.3.33687 Compiling wasm-bindgen-macro-support v0.2.126688 Compiling zstd-sys v2.0.16+zstd.1.5.7689 Compiling hashbrown v0.15.5690 Compiling kamadak-exif v0.6.1691 Compiling darling_macro v0.21.3692 Compiling csv v1.4.0693 Compiling wasmi v1.1.0694 Compiling cranelift-codegen v0.130.2695 Compiling typst-syntax v0.15.0696 Compiling hayagriva v0.10.1697 Compiling wasm-encoder v0.245.1698 Compiling two-face v0.4.5699 Compiling dioxus-signals v0.7.9700 Compiling hkdf v0.12.4701 Compiling webpki-roots v1.0.8702 Compiling regex v1.13.0703 Compiling chrono v0.4.45704 Compiling lipsum v0.9.1705 Compiling wasm-bindgen v0.2.126706 Compiling typst-macros v0.15.0707 Compiling typst-assets v0.15.0708 Compiling glidesort v0.1.2709 Compiling crc-catalog v2.5.0710 Compiling winnow v1.0.3711 Compiling arbitrary v1.4.2712 Compiling typed-arena v2.0.2713 Compiling object v0.37.3714 Compiling icu_segmenter_data v2.2.0715 Compiling byteorder v1.5.0716 Compiling termcolor v1.4.1717 Compiling wasmtime-internal-component-util v43.0.2718 Compiling az v1.3.0719 Compiling cranelift-control v0.130.2720 Compiling toml_parser v1.1.2+spec-1.1.0721 Compiling wasmprinter v0.245.1722 Compiling crc v3.4.0723 Compiling typst-library v0.15.0724 Compiling wasm-bindgen-macro v0.2.126725 Compiling darling v0.21.3726 Compiling hashlink v0.10.0727 Compiling h2 v0.4.15728 Compiling lazy_static v1.5.0729 Compiling regalloc2 v0.15.1730 Compiling color v0.3.3731 Compiling serde_urlencoded v0.7.1732 Compiling dioxus-cli-config v0.7.9733 Compiling hayro-postscript v0.1.0734 Compiling rustc-demangle v0.1.28735 Compiling linebender_resource_handle v0.1.1736 Compiling io-extras v0.18.4737 Compiling peniko v0.6.1738 Compiling hyper v1.10.1739 Compiling wasmtime-environ v43.0.2740 Compiling hayro-cmap v0.1.0741 Compiling system-configuration v0.7.0742 Compiling enumset_derive v0.15.0743 Compiling dioxus-rsx v0.7.9744 Compiling concurrent-queue v2.5.0745 Compiling guillotiere v0.7.0746 Compiling const-serialize-macro v0.7.2747 Compiling cookie v0.18.1748 Compiling leb128 v0.2.7749 Compiling unicase v2.9.0750 Compiling cap-primitives v3.4.5751 Compiling zstd-safe v7.2.4752 Compiling ambient-authority v0.0.2753 Compiling utf-8 v0.7.6754 Compiling strsim v0.11.1755 Compiling mime_guess v2.0.5756 Compiling const-serialize v0.7.2757 Compiling wast v35.0.2758 Compiling vello_common v0.0.8759 Compiling ar_archive_writer v0.5.2760 Compiling tokio-stream v0.1.18761 Compiling js-sys v0.3.103762 Compiling event-listener v5.4.1763 Compiling icu_segmenter v2.2.0764 Compiling dioxus-core-macro v0.7.9765 Compiling enumset v1.1.13766 Compiling hyper-util v0.1.20767 Compiling futures-intrusive v0.5.0768 Compiling hayro-interpret v0.7.0769 Compiling fs-set-times v0.20.3770 Compiling crossbeam-queue v0.3.13771 Compiling dioxus-hooks v0.7.9772 Compiling dioxus-document v0.7.9773 Compiling dioxus-html-internal-macro v0.7.9774 Compiling wasm-encoder v0.253.0775 Compiling tower v0.5.3776 Compiling stringprep v0.1.5777 Compiling icu_provider_blob v2.2.0778 Compiling http v0.2.12779 Compiling keyboard-types v0.7.0780 Compiling signature v2.2.0781 Compiling serde_repr v0.1.20782 Compiling const-serialize-macro v0.8.0-alpha.0783 Compiling ff v0.13.1784 Compiling bitmaps v2.1.0785 Compiling multer v3.1.0786 Compiling im-rc v15.1.0787 Compiling wasmtime-internal-unwinder v43.0.2788 Compiling id-arena v2.3.0789 Compiling dotenvy v0.15.7790 Compiling compression-core v0.4.32791 Compiling whoami v1.6.1792 Compiling unicode-width v0.2.2793 Compiling hex v0.4.3794 Compiling hypher v0.1.7795 Compiling home v0.5.12796 Compiling base16ct v0.2.0797 Compiling maybe-owned v0.3.4798 Compiling rustls v0.21.12799 Compiling sqlx-core v0.8.6800 Compiling sec1 v0.7.3801 Compiling sized-chunks v0.6.5802 Compiling wast v253.0.0803 Compiling compression-codecs v0.4.38804 Compiling wit-parser v0.245.1805 Compiling dioxus-html v0.7.9806 Compiling group v0.13.0807 Compiling vello_cpu v0.0.8808 Compiling psm v0.1.31809 Compiling atoi v2.0.0810 Compiling tungstenite v0.29.0811 Compiling wasmtime-internal-jit-debug v43.0.2812 Compiling wasmtime-internal-fiber v43.0.2813 Compiling rustls-webpki v0.101.7814 Compiling sct v0.7.1815 Compiling pic-scale v0.7.10816 Compiling md-5 v0.10.6817 Compiling crypto-bigint v0.5.5818 Compiling rand_xoshiro v0.6.0819 Compiling dirs-sys-next v0.1.2820 Compiling toml_datetime v0.7.5+spec-1.1.0821 Compiling serde_spanned v1.1.1822 Compiling cap-std v3.4.5823 Compiling fixedbitset v0.4.2824 Compiling toml_writer v1.1.1+spec-1.1.0825 Compiling wasmtime-internal-component-macro v43.0.2826 Compiling wasmtime-internal-cache v43.0.2827 Compiling system-configuration-sys v0.5.0828 Compiling sqlx-postgres v0.8.6829 Compiling typst-layout v0.15.0830 Compiling wat v1.253.0831 Compiling hayro v0.7.1832 Compiling toml v0.9.12+spec-1.1.0833 Compiling elliptic-curve v0.13.8834 Compiling petgraph v0.6.5835 Compiling directories-next v2.0.0836 Compiling cranelift-frontend v0.130.2837 Compiling cranelift-native v0.130.2838 Compiling wasmtime-internal-wit-bindgen v43.0.2839 Compiling tokio-tungstenite v0.29.0840 Compiling zstd v0.13.3841 Compiling web-sys v0.3.103842 Compiling async-compression v0.4.42843 Compiling hayro-svg v0.7.0844 Compiling h2 v0.3.27845 Compiling http-body v0.4.6846 Compiling witx v0.9.1847 Compiling darling_core v0.23.0848 Compiling tungstenite v0.28.0849 Compiling sharded-slab v0.1.7850 Compiling cfb v0.7.3851 Compiling wasmtime v43.0.2852 Compiling dioxus-history v0.7.9853 Compiling matchers v0.2.0854 Compiling rustc_version v0.4.1855 Compiling debugid v0.8.0856 Compiling proc-macro-utils v0.10.0857 Compiling itertools v0.14.0858 Compiling stacker v0.1.24859 Compiling axum-macros v0.5.1860 Compiling tracing-log v0.2.0861 Compiling socket2 v0.5.10862 Compiling thread_local v1.1.9863 Compiling http-range-header v0.4.2864 Compiling cbindgen v0.29.4865 Compiling matchit v0.8.4866 Compiling inventory v0.3.24867 Compiling litrs v1.0.0868 Compiling toml_datetime v1.1.1+spec-1.1.0869 Compiling nu-ansi-term v0.50.3870 Compiling psl-types v2.0.11871 Compiling wiggle-macro v43.0.2872 Compiling rustix v0.38.44873 Compiling document-features v0.2.12874 Compiling wasmtime-internal-cranelift v43.0.2875 Compiling hyper v0.14.32876 Compiling publicsuffix v2.3.0877 Compiling tracing-subscriber v0.3.23878 Compiling axum v0.8.9879 Compiling toml_edit v0.25.12+spec-1.1.0880 Compiling dioxus-fullstack-core v0.7.9881 Compiling tower-http v0.6.11882 Compiling manyhow-macros v0.11.4883 Compiling darling_macro v0.23.0884 Compiling curve25519-dalek v4.1.3885 Compiling tempfile v3.27.0886 Compiling fxprof-processed-profile v0.8.1887 Compiling infer v0.19.0888 Compiling wiggle-generate v43.0.2889 Compiling typst-svg v0.15.0890 Compiling tokio-rustls v0.24.1891 Compiling wasm-compose v0.245.1892 Compiling sqlx-macros-core v0.8.6893 Compiling wasm-bindgen-futures v0.4.76894 Compiling const-serialize v0.8.0-alpha.0895 Compiling tokio-rustls v0.26.4896 Compiling dioxus-interpreter-js v0.7.9897 Compiling rfc6979 v0.4.0898 Compiling addr2line v0.26.1899 Compiling write-fonts v0.48.1900 Compiling wasmtime-internal-jit-icache-coherence v43.0.2901 Compiling convert_case v0.10.0902 Compiling pdf-writer v0.15.0903 Compiling headers-core v0.3.0904 Compiling rmp v0.8.15905 Compiling mach2 v0.4.3906 Compiling utf8parse v0.2.2907 Compiling cap-fs-ext v3.4.5908 Compiling base64 v0.21.7909 Compiling base16 v0.2.1910 Compiling num-bigint-dig v0.8.6911 Compiling system-interface v0.27.3912 Compiling bitflags v1.3.2913 Compiling option-ext v0.2.0914 Compiling objc2 v0.6.4915 Compiling dirs-sys v0.5.0916 Compiling system-configuration v0.5.1917 Compiling rustls-pemfile v1.0.4918 Compiling dioxus-router-macro v0.7.9919 Compiling prost-derive v0.14.4920 Compiling rmp-serde v1.3.1921 Compiling anstyle-parse v1.0.0922 Compiling hayro-write v0.7.0923 Compiling headers v0.4.1924 Compiling sqlx-macros v0.8.6925 Compiling derive_more-impl v2.1.1926 Compiling ecdsa v0.16.9927 Compiling manganis-core v0.7.9928 Compiling hyper-rustls v0.27.9929 Compiling hyper-rustls v0.24.2930 Compiling typst-html v0.15.0931 Compiling darling v0.23.0932 Compiling manyhow v0.11.4933 Compiling gloo-utils v0.2.0934 Compiling proc-macro-crate v3.5.0935 Compiling cookie_store v0.22.1936 Compiling tokio-tungstenite v0.28.0937 Compiling primeorder v0.13.6938 Compiling tungstenite v0.27.0939 Compiling webpki-roots v0.26.11940 Compiling tower-sessions-core v0.14.0941 Compiling dioxus-devtools-types v0.7.9942 Compiling charset v0.1.5943 Compiling tiny-skia v0.12.0944 Compiling num-iter v0.1.46945 Compiling subsetter v0.2.6946 Compiling rgb v0.8.53947 Compiling serde_qs v0.15.0948 Compiling inout v0.1.4949 Compiling async-stream-impl v0.3.6950 Compiling macro-string v0.1.4951 Compiling hashbrown v0.14.5952 Compiling is_terminal_polyfill v1.70.2953 Compiling objc2-encode v4.1.0954 Compiling dunce v1.0.5955 Compiling webpki-roots v0.25.4956 Compiling xmp-writer v0.3.3957 Compiling xxhash-rust v0.8.16958 Compiling zip v2.4.2959 Compiling anstyle v1.0.14960 Compiling sync_wrapper v0.1.2961 Compiling anstyle-query v1.1.5962 Compiling colorchoice v1.0.5963 Compiling askama_escape v0.13.0964 Compiling anstream v1.0.0965 Compiling reqwest v0.11.27966 Compiling dioxus-ssr v0.7.9967 Compiling dashmap v6.2.1968 Compiling krilla v0.8.2969 Compiling dioxus-fullstack-macro v0.7.9970 Compiling resvg v0.47.0971 Compiling manganis-macro v0.7.9972 Compiling extism v1.30.0973 Compiling async-stream v0.3.6974 Compiling cipher v0.4.4975 Compiling sqlx v0.8.6976 Compiling content_disposition v0.4.0977 Compiling dioxus-devtools v0.7.9978 Compiling async-tungstenite v0.31.0979 Compiling ureq v2.12.1980 Compiling typst-realize v0.15.0981 Compiling reqwest v0.12.28982 Compiling derive_more v2.1.1983 Compiling extism-convert-macros v1.30.0984 Compiling gloo-net v0.6.0985 Compiling serde_with_macros v3.21.0986 Compiling typst-eval v0.15.0987 Compiling axum-extra v0.10.3988 Compiling prost v0.14.4989 Compiling dioxus-router v0.7.9990 Compiling dirs v6.0.0991 Compiling wasm-streams v0.4.2992 Compiling dioxus-asset-resolver v0.7.9993 Compiling dioxus-logger v0.7.9994 Compiling cap-time-ext v3.4.5995 Compiling ed25519 v2.2.3996 Compiling cap-rand v3.4.5997 Compiling pkcs1 v0.7.5998 Compiling dioxus-stores-macro v0.7.9999 Compiling tracing-futures v0.2.51000 Compiling lru v0.16.41001 Compiling ureq-proto v0.6.01002 Compiling zopfli v0.8.31003 Compiling universal-hash v0.5.11004 Compiling ordered-float v2.10.11005 Compiling send_wrapper v0.6.01006 Compiling clap_lex v1.1.01007 Compiling base64 v0.13.11008 Compiling opaque-debug v0.3.11009 Compiling utf8-zero v0.8.11010 Compiling const-str v0.7.11011 Compiling ureq v3.3.01012 Compiling oauth2 v4.4.21013 Compiling poly1305 v0.8.01014 Compiling dioxus-fullstack v0.7.9 (/nix/var/nix/builds/nix-54963-284930785/source/vendor/dioxus-fullstack-0.7.9)1015 Compiling serde-value v0.7.01016 Compiling clap_builder v4.6.01017 Compiling dioxus-stores v0.7.91018 Compiling dioxus-server v0.7.91019 Compiling rsa v0.9.101020 Compiling ed25519-dalek v2.2.01021 Compiling typst v0.15.01022 Compiling extism-convert v1.30.01023 Compiling typst-kit v0.15.01024 Compiling serde_with v3.21.01025 Compiling krilla-svg v0.8.11026 Compiling manganis v0.7.91027 Compiling chacha20 v0.9.11028 Compiling tower-sessions-memory-store v0.14.01029 Compiling p384 v0.13.11030 Compiling p256 v0.13.21031 Compiling tower-cookies v0.11.01032 Compiling itertools v0.10.51033 Compiling extism-manifest v1.30.01034 Compiling serde_plain v1.0.21035 Compiling clap_derive v4.6.11036 Compiling aead v0.5.21037 Compiling dioxus-config-macro v0.7.91038 Compiling dyn-clone v1.0.201039 Compiling horae v0.1.0 (/nix/var/nix/builds/nix-54963-284930785/source/crates/horae)1040 Compiling dioxus-config-macros v0.7.91041 Compiling glob v0.3.31042 Compiling dioxus v0.7.91043 Compiling chacha20poly1305 v0.10.11044 Compiling tower-sessions v0.14.01045 Compiling typst-pdf v0.15.01046 Compiling typst-as-lib v0.16.01047 Compiling rust_xlsxwriter v0.80.01048 Compiling horae-core v0.1.0 (/nix/var/nix/builds/nix-54963-284930785/source/crates/core)1049 Compiling clap v4.6.11050 Compiling openidconnect v3.5.01051 Compiling tower-sessions-sqlx-store v0.15.01052 Compiling serial_test_derive v3.5.01053 Compiling serial_test v3.5.01054 Compiling wiggle v43.0.21055 Compiling wasi-common v43.0.21056 Finished `test` profile [unoptimized + debuginfo] target(s) in 6m 31s1057 Running unittests src/main.rs (target/debug/deps/horae-d25262ae1fc74356)10581059running 840 tests1060test auth::oidc::tests::deactivated_email_match_is_denied ... ok1061test auth::oidc::tests::deactivated_subject_match_is_denied ... ok1062test auth::oidc::tests::first_login_links_subject_via_verified_email ... ok1063test auth::oidc::tests::no_account_is_denied_not_provisioned ... ok1064test auth::oidc::tests::subject_match_logs_in_without_relinking ... ok1065test auth::oidc::tests::extra_audiences_are_trusted_only_when_listed ... ok1066test auth::oidc::tests::subject_match_takes_precedence_over_email ... ok1067test auth::oidc::tests::unverified_email_is_not_matched ... ok1068test auth::page::tests::configured_label_is_html_escaped ... ok1069test auth::page::tests::oidc_variant_uses_the_configured_label_and_hands_off_to_start ... ok1070test auth::page::tests::dev_variant_offers_the_admin_bypass_and_no_fake_controls ... ok1071test cli::imports::tests::invalid_csv_files_fail_before_contacting_the_server ... ok1072test cli::imports::tests::csv_named_pipe_is_rejected_without_waiting_for_a_writer ... ok1073test cli::imports::tests::cancellation_racing_completion_does_not_claim_cancellation_was_requested ... ok1074test cli::imports::tests::api_submission_captures_generation_without_retrying_uncertain_acceptance ... ok1075test cli::imports::tests::missing_session_is_a_structured_configuration_failure ... ok1076test cli::imports::tests::malformed_submission_acknowledgement_retains_its_request_identity ... ok1077test cli::imports::tests::missing_and_mismatched_jobs_fail_without_substitution ... ok1078test cli::imports::tests::redirects_are_not_followed_or_exposed_as_server_error_text ... ok1079test cli::imports::tests::private_session_accepts_https_and_loopback_only ... ok1080test cli::imports::tests::retry_snapshot_is_compatible_with_missing_and_future_values ... ok1081test cli::imports::tests::report_marks_confirmed_failed_outcomes_as_incomplete ... ok1082test cli::imports::tests::ordinary_json_is_bounded_and_invalid_replies_are_not_echoed ... ok1083test cli::imports::tests::session_rejects_public_permissions_and_symlinks ... ok1084test cli::imports::tests::archived_errors_publish_without_clobbering_and_preserve_the_prior_file_on_failure ... ok1085test cli::imports::tests::session_rejects_cookie_header_injection_without_echoing_the_value ... ok1086test cli::imports::tests::session_rejects_plaintext_remote_and_credential_bearing_urls ... ok1087test cli::tests::environment_probe ... ok1088test cli::tests::remote_commands_reject_conflicting_or_unbounded_options ... ok1089test cli::tests::remote_import_and_job_commands_accept_the_documented_arguments ... ok1090test config::tests::dev_login_is_allowed_on_loopback ... ok1091test config::tests::dev_login_is_refused_off_loopback ... ok1092test cli::imports::tests::status_and_wait_distinguish_failed_jobs_from_failed_reads ... ok1093test config::tests::environment::environment_probe ... ok1094test config::tests::environment::empty_environment_has_no_authentication_or_plugin_credentials ... ok1095test cli::tests::default_command_uses_the_same_defaults_and_environment_as_serve ... ok1096test config::tests::environment::example_environment_can_configure_all_required_oidc_and_harvest_fields ... ok1097test cli::tests::default_command_rejects_invalid_environment_ports ... ok1098test config::tests::environment::obsolete_authentication_variables_do_not_configure_the_server ... ok1099test config::tests::environment::partial_oidc_configuration_remains_disabled_without_a_callback ... ok1100test config::tests::environment::job_attempt_limit_uses_the_documented_environment_variable ... ok1101test config::tests::without_dev_login_any_bind_is_fine ... ok1102test db::tests::pool_connections_force_custom_plans ... ok1103test config::tests::environment::mail_environment_requires_a_complete_valid_configuration ... ok1104test config::tests::environment::invalid_job_attempt_limits_reject_startup ... ok1105test config::tests::environment::secure_cookies_use_the_documented_prefixed_variable ... ok1106test auth::oidc::tests::linking::unverified_email_cannot_link_an_account ... ok1107test auth::oidc::tests::linking::different_subjects_cannot_both_claim_an_unlinked_account ... ok1108test auth::oidc::tests::linking::simultaneous_logins_with_the_same_subject_are_allowed ... ok1109test auth::oidc::tests::linking::deactivation_during_first_link_denies_login ... ok1110test harvest::pagination_tests::harvest_own_time_omits_private_project_budget_metadata ... ok1111test auth::oidc::tests::linking::existing_subject_wins_over_another_accounts_email ... ok1112test harvest::pagination_tests::harvest_pagination_total_pages_does_not_overflow ... ok1113test db::tests::reset_empties_the_database_and_reapplies_migrations ... ok1114test harvest::pagination_tests::harvest_pagination_catalog_links_preserve_filters_and_break_name_ties ... ok1115test harvest::tests::a_manager_lists_users_with_their_rates ... ok1116test harvest::pagination_tests::harvest_pagination_empty_and_out_of_range_pages_keep_the_contract ... ok1117test cli::imports::tests::wait_deadline_caps_a_pending_request_without_cancelling_the_job ... ok1118test harvest::pagination_tests::harvest_pagination_malformed_filters_are_client_errors ... ok1119test harvest::tests::a_member_cannot_fetch_a_colleagues_entry ... ok1120test harvest::tests::a_manager_sees_the_whole_org ... ok1121test harvest::tests::a_member_cannot_filter_to_a_colleague ... ok1122test harvest::tests::a_member_cannot_list_users ... ok1123test harvest::tests::harvest_effective_minutes_match_sql_for_open_and_frozen_time ... ok1124test harvest::pagination_tests::harvest_pagination_rejects_invalid_windows_on_every_collection ... ok1125test harvest::tests::a_member_sees_only_their_own_time_entries ... ok1126test harvest::tests::harvest_entry_rates_follow_the_cascade_and_frozen_invoice_line ... ok1127test harvest::tests::page_window_defaults_and_checked_offsets ... ok1128test harvest::tests::members_cannot_read_own_project_rates_or_cost_overrides ... ok1129test harvest::tests::harvest_entry_rates_respect_selected_project_mode ... ok1130test harvest::tests::harvest_marks_unbilled_non_billable_contexts_consistently ... ok1131test harvest::pagination_tests::harvest_pagination_router_preserves_session_and_tenant_guards ... ok1132test importers::harvest::account_switch::tests::a_b_a_keeps_old_callbacks_requests_and_retries_fenced ... ok1133test importers::harvest::account_switch::tests::competing_change_and_submission_cannot_both_succeed ... ok1134test importers::harvest::account_switch::tests::change_preserves_terminal_history_and_rejects_stale_confirmation ... ok1135test importers::harvest::account_switch::tests::disconnect_and_reconnect_fence_callbacks_but_not_same_account_work ... ok1136test harvest::pagination_tests::harvest_project_progress_permissions_cover_counts_pages_and_details ... ok1137test importers::harvest::account_switch::tests::competing_callbacks_and_confirmations_have_one_winner ... ok1138test importers::harvest::api_source::http::tests::cancelled_backoff_does_not_wait_or_retry ... ok1139test importers::harvest::api_source::http::tests::cursor_links_are_authoritative_even_with_null_or_stale_page_numbers ... ok1140test importers::harvest::api_source::http::tests::http_pages_follow_cursor_and_preserve_headers_and_encoded_filter ... ok1141test importers::harvest::account_switch::tests::queue_acceptance_does_not_wait_for_the_import_session_lock ... ok1142test importers::harvest::account_switch::tests::queued_work_and_provenance_block_without_changing_binding ... ok1143test importers::harvest::account_switch::tests::retry_and_change_are_serialized ... ok1144test importers::harvest::api_source::http::tests::missing_next_cursor_is_not_silently_treated_as_completed ... ok1145test importers::harvest::account_switch::tests::running_jobs_block_change_and_old_execution_never_reaches_http ... ok1146test importers::harvest::account_switch::tests::successful_change_preserves_business_rows_and_failure_rolls_back_secrets ... ok1147test importers::harvest::api_source::http::tests::rejected_page_does_not_advance_the_cursor ... ok1148test harvest::pagination_tests::harvest_pagination_time_entries_keep_the_filtered_set_and_date_ties ... ok1149test importers::harvest::api_source::http::tests::rejects_pagination_outside_the_authenticated_endpoint ... ok1150test importers::harvest::api_source::http::tests::persisted_cursor_resumes_with_a_new_client_and_stays_complete_at_eof ... ok1151test importers::harvest::api_source::http::tests::resumed_cursor_rejects_untrusted_destinations_and_invalid_state_before_http ... ok1152test importers::harvest::api_source::tests::hours_render_as_exact_decimals ... ok1153test importers::harvest::api_source::tests::assembles_rows_joining_parents_by_id ... ok1154test importers::harvest::api_source::tests::assembled_rows_convert_to_exact_minutes ... ok1155test importers::harvest::api_source::http::tests::pagination_cycle_detection_survives_restarting_after_every_page ... ok1156test importers::harvest::api_source::tests::json_exponents_expand_exactly_with_bounded_output ... ok1157test importers::harvest::credentials::tests::bad_key_length_is_rejected ... ok1158test importers::harvest::api_source::tests::http_page_preserves_decimal_values_before_integer_conversion ... ok1159test importers::harvest::api_source::http::tests::http_retries_429_but_never_follows_redirects_or_shortens_long_backoff ... ok1160test importers::harvest::api_source::http::tests::http_rejects_oversized_malformed_and_cyclic_pages ... ok1161test importers::harvest::credentials::tests::decode_hex_rejects_bad_input ... ok1162test importers::harvest::credentials::tests::another_account_cannot_replace_credentials_or_watermarks ... ok1163test importers::harvest::credentials::tests::encrypt_then_decrypt_round_trips ... ok1164test importers::harvest::credentials::tests::concurrent_first_connections_cannot_bind_different_accounts ... ok1165test importers::harvest::credentials::tests::connect_and_disconnect_share_import_exclusion_without_blocking_other_orgs ... ok1166test importers::harvest::credentials::tests::nonce_makes_ciphertext_nondeterministic ... ok1167test importers::harvest::credentials::tests::connection_changes_work_with_a_single_connection_pool ... ok1168test harvest::pagination_tests::harvest_task_access_filters_counts_and_preserves_rate_free_history ... ok1169test importers::harvest::credentials::tests::wrong_key_fails_to_decrypt ... ok1170test importers::harvest::csv_source::tests::bad_date_becomes_a_row_error_not_a_rejection ... ok1171test importers::harvest::csv_source::tests::conflicting_email_aliases_error_only_the_affected_row ... ok1172test importers::harvest::csv_source::tests::csv_records_preserve_multiline_unicode_across_single_byte_reads ... ok1173test importers::harvest::csv_source::tests::cursor_beyond_upload_is_rejected_without_parsing_rows ... ok1174test importers::harvest::csv_source::tests::cursor_resumes_after_multiline_unicode_and_preserves_error_locations ... ok1175test importers::harvest::csv_source::tests::delivers_a_row_before_reading_the_rest_of_the_file ... ok1176test importers::harvest::csv_source::tests::empty_file_is_rejected ... ok1177test importers::harvest::csv_source::tests::identity_columns_are_required_and_cannot_repeat ... ok1178test importers::harvest::csv_source::tests::invalid_utf8_errors_one_record_and_continues ... ok1179test importers::harvest::csv_source::tests::missing_required_columns_is_rejected ... ok1180test importers::harvest::csv_source::tests::names_stay_separate_from_optional_email ... ok1181test importers::harvest::csv_source::tests::parse_bool_accepts_yes_variants ... ok1182test importers::harvest::csv_source::tests::parses_rows_case_insensitively ... ok1183test importers::harvest::api_source::http::tests::slow_consumer_backpressures_http_and_cancellation_stops_further_pages ... ok1184test importers::harvest::credentials::tests::disconnect_preserves_identity_and_provenance_for_the_original_account ... ok1185test importers::harvest::credentials::tests::migration_binds_existing_connections_without_changing_secrets_or_markers ... ok1186test harvest::tests::imported_legacy_rates_survive_retry_in_harvest_list_and_detail ... ok1187test importers::harvest::engine_tests::api_connection_checks_work_with_a_single_connection_pool ... ok1188test importers::harvest::credentials::tests::unidentified_legacy_provenance_requires_operator_review ... ok1189test importers::harvest::engine_tests::api_and_csv_share_the_lock_but_other_organizations_can_import ... ok1190test importers::harvest::credentials::tests::same_account_reconnect_rotates_encryption_without_resetting_watermarks ... ok1191test importers::harvest::credentials::tests::failed_credential_write_does_not_leave_an_account_binding ... ok1192test importers::harvest::credentials::tests::completed_credential_changes_allow_immediate_retries ... ok1193test importers::harvest::engine_tests::bad_records_are_reported_and_run_continues ... ok1194test importers::harvest::engine_tests::csv_import_populates_and_is_idempotent ... ok1195test importers::harvest::engine_tests::cancelled_http_waiter_keeps_the_lock_until_its_worker_exits ... ok1196test importers::harvest::engine_tests::api_sync_adopts_entries_from_a_prior_csv_import ... ok1197test importers::harvest::engine_tests::csv_ambiguous_names_include_inactive_users_but_unique_email_disambiguates ... ok1198test importers::harvest::engine_tests::concurrent_imports_reject_overlap_without_collapsing_repeated_entries ... ok1199test importers::harvest::engine_tests::cancellation_rolls_back_rows_and_releases_the_import_session ... ok1200test harvest::pagination_tests::harvest_project_cost_overrides_require_admin_without_fabricated_fallback ... ok1201test importers::harvest::engine_tests::completed_imports_allow_immediate_retries ... ok1202test importers::harvest::engine_tests::csv_streaming::cancelling_a_csv_waiting_for_more_bytes_releases_its_session ... ok1203test importers::harvest::engine_tests::csv_name_fallback_requires_a_full_unique_name_and_never_overrides_email ... ok1204test importers::harvest::engine_tests::csv_name_only_matches_one_org_user_and_reimports_without_duplicates ... ok1205test importers::harvest::engine_tests::csv_streaming::csv_applies_before_eof_but_transport_failure_rolls_back_everything ... ok1206test importers::harvest::engine_tests::csv_name_only_dry_run_and_duplicate_occurrences_preserve_history ... ok1207test importers::harvest::engine_tests::csv_malformed_file_is_rejected_with_no_writes ... ok1208test importers::harvest::engine_tests::csv_streaming::csv_preview_errors_and_repeated_rows_match_commit_and_reimport ... ok1209test importers::harvest::engine_tests::csv_streaming::durable_csv_preview_crosses_batch_boundaries_without_committing_domain_data ... ok1210test importers::harvest::engine_tests::csv_streaming::durable_csv_preview_resumes_after_a_crash_without_recounting_rows ... ok1211test importers::harvest::engine_tests::csv_streaming::csv_sql_backpressure_stops_reading_later_input_rows ... ok1212test importers::harvest::engine_tests::csv_streaming::durable_csv_preview_rejects_a_stale_next_batch ... ok1213test importers::harvest::engine_tests::csv_streaming::measure_csv_durable_100k ... ignored, 100,000-row durable CSV measurement; run explicitly with --release --nocapture1214test importers::harvest::engine_tests::csv_streaming::measure_csv_durable_large_catalog_100k ... ignored, 100,000-row durable CSV with 5,000 parent sets; run explicitly with --release --nocapture1215test importers::harvest::engine_tests::csv_streaming::measure_csv_streaming_100k ... ignored, 100,000-row CSV measurement; run explicitly with --release --nocapture1216test importers::harvest::engine_tests::csv_streaming::measure_csv_streaming_large_catalog_100k ... ignored, 100,000-row CSV with 5,000 parent sets; run explicitly with --release --nocapture1217test importers::harvest::engine_tests::csv_streaming::durable_csv_stale_commit_is_fenced_without_a_heartbeat ... ok1218test importers::harvest::engine_tests::csv_streaming::durable_csv_reclaimed_lease_cannot_commit_the_next_batch ... ok1219test importers::harvest::engine_tests::csv_streaming::durable_csv_report_metadata_is_bounded_after_recovery ... ok1220test importers::harvest::engine_tests::edited_entry_still_matched_by_provenance ... ok1221test importers::harvest::engine_tests::dry_run_writes_nothing_and_matches_commit ... ok1222test importers::harvest::engine_tests::distinct_harvest_ids_with_identical_fields_import_as_two ... ok1223test importers::harvest::engine_tests::failed_source_releases_the_session_and_rolls_back_partial_rows ... ok1224test importers::harvest::engine_tests::full_import_creates_all_levels_with_exact_minutes ... ok1225test importers::harvest::engine_tests::import_rejects_ambiguous_normalized_email_without_partial_writes ... ok1226test importers::harvest::engine_tests::lookup_cache::cold_query_callsite_on_untraced_thread_is_still_captured ... ok1227test importers::harvest::engine_tests::csv_streaming::durable_csv_resumes_committed_batches_without_recounting_duplicate_rows ... ok1228test importers::harvest::engine_tests::csv_streaming::csv_measurement_recovers_a_complete_batch_without_recounting ... ok1229test importers::harvest::engine_tests::csv_streaming::durable_csv_cancel_joins_parser_and_preserves_committed_rows ... ok1230test importers::harvest::engine_tests::lookup_cache::new_run_rechecks_previously_cached_user_for_ambiguity ... ok1231test importers::harvest::engine_tests::lookup_cache::cached_email_and_full_name_do_not_share_a_namespace ... ok1232test importers::harvest::engine_tests::lookup_cache::lookup_index_migration_preserves_existing_ambiguous_identities ... ok1233test importers::harvest::engine_tests::lookup_cache::cached_project_task_still_validates_each_rows_rate ... ok1234test importers::harvest::engine_tests::lookup_cache::project_task_cache_distinguishes_both_sides_of_the_link ... ok1235test importers::harvest::engine_tests::csv_streaming::durable_csv_preview_cancel_preserves_simulation_for_manual_retry ... ok1236test importers::harvest::engine_tests::natural_key_reimport_normalizes_whitespace_and_ascii_case ... ok1237test importers::harvest::engine_tests::second_identical_run_creates_nothing ... ok1238test importers::harvest::engine_tests::reimporting_identical_csv_rows_is_idempotent ... ok1239test importers::harvest::engine_tests::lookup_cache::rolled_back_row_does_not_cache_user_or_project_task ... ok1240test importers::harvest::oauth::tests::authorize_url_carries_state_and_encoded_redirect ... ok1241test importers::harvest::oauth_callback_tests::account_policy_failures_return_safe_actionable_conflicts ... ok1242test importers::harvest::oauth::tests::authorize_url_preserves_query_values_without_injecting_parameters ... ok1243test importers::harvest::engine_tests::overflowing_decimals_fail_only_their_rows ... ok1244test importers::harvest::oauth_callback_tests::mismatched_state_is_rejected_without_a_code ... ok1245test importers::harvest::oauth_callback_tests::missing_returned_state_is_rejected ... ok1246test importers::harvest::oauth_callback_tests::missing_stored_state_is_rejected ... ok1247test importers::harvest::oauth_callback_tests::provider_error_is_rejected_before_exchange ... ok1248test importers::harvest::oauth_callback_tests::valid_matching_state_yields_the_code ... ok1249test importers::harvest::oauth_callback_tests::valid_state_but_missing_code_is_rejected ... ok1250test importers::harvest::report::tests::archive_metadata_cannot_masquerade_as_a_legacy_or_inconsistent_report ... ok1251test importers::harvest::report::tests::archived_report_round_trips_without_losing_error_accounting ... ok1252test importers::harvest::report::tests::legacy_report_preserves_its_counts_and_error_details ... ok1253test importers::harvest::report::tests::serialized_report_has_a_supported_schema_version ... ok1254test importers::harvest::resolve::checkpoint_tests::run_cache_round_trip_preserves_identity_namespaces_and_occurrences ... ok1255test importers::harvest::report::tests::report_rejects_unsupported_and_invalid_versions ... ok1256test importers::harvest::engine_tests::csv_streaming::durable_csv_cancel_preserves_its_completed_batches_for_manual_retry ... ok1257test importers::harvest::engine_tests::submission_barrier_blocks_imported_time_entries ... ok1258test importers::harvest::resolve::preview::tests::rejects_foreign_parent_snapshots_before_restoring_any_rows ... ok1259test importers::harvest::engine_tests::watermark_advances_only_on_commit ... ok1260test importers::harvest::engine_tests::two_identical_csv_rows_import_as_two_entries ... ok1261test importers::harvest::streaming::tests::api_planning_policy_ends_with_the_transaction ... ok1262test importers::harvest::resolve::preview::tests::checkpoint_restores_known_task_currency_and_keeps_old_currency_unknown ... ok1263test importers::harvest::streaming::durable::preview::tests::restoration_omits_unneeded_virtual_entries ... ok1264test importers::harvest::engine_tests::lookup_cache::repeated_rows_resolve_each_user_and_project_task_once ... ok1265test importers::harvest::sync_tests::api_rejects_ambiguous_email_without_advancing_watermark ... ok1266test importers::harvest::engine_tests::large_run_reuses_parents_and_reconciles_totals ... ok1267test importers::harvest::sync_tests::api_requires_email_even_when_full_name_matches ... ok1268test importers::harvest::engine_tests::csv_streaming::durable_csv_preview_matches_existing_and_new_rows_with_one_connection ... ok1269test importers::harvest::sync_tests::checkpoints::durable_api_cancellation_preserves_confirmed_pages_for_manual_retry ... ok1270test importers::harvest::sync_tests::checkpoints::durable_api_preview_cancellation_preserves_confirmed_pages_for_manual_retry ... ok1271test importers::harvest::sync_tests::checkpoints::durable_api_preview_finalization_retry_does_not_repeat_completed_downloads ... ok1272test importers::harvest::sync_tests::checkpoints::durable_api_finalization_retry_does_not_repeat_completed_downloads ... ok1273test importers::harvest::sync_tests::checkpoints::durable_api_preview_reclaimed_worker_cannot_checkpoint_its_next_page ... ok1274test importers::harvest::sync_tests::checkpoints::durable_api_preview_resumes_catalog_download ... ok1275test importers::harvest::sync_tests::checkpoints::durable_api_preview_resumes_pages_without_publishing_domain_data ... ok1276test importers::harvest::sync_tests::checkpoints::durable_api_preview_resume_preserves_row_errors ... ok1277test importers::harvest::sync_tests::checkpoints::durable_api_preview_resumes_after_a_confirmed_parent_batch ... ok1278test importers::harvest::sync_tests::disconnect_and_reconnect_preserves_imported_records_and_exact_identity ... ok1279test importers::harvest::sync_tests::checkpoints::durable_api_resume_remembers_an_earlier_missing_timestamp ... ok1280test importers::harvest::sync_tests::dry_run_leaves_data_provenance_and_watermark_unchanged ... ok1281test importers::harvest::sync_tests::checkpoints::durable_api_reclaimed_worker_cannot_commit_its_next_page ... ok1282test importers::harvest::sync_tests::empty_sync_does_not_invent_a_watermark ... ok1283test importers::harvest::sync_tests::exact_api_decimals_survive_preview_commit_and_reimport ... ok1284test importers::harvest::sync_tests::checkpoints::durable_api_resumes_a_partially_downloaded_catalog ... ok1285test importers::harvest::sync_tests::checkpoints::durable_api_resume_keeps_earlier_errors_and_does_not_advance_watermark ... ok1286test importers::harvest::sync_tests::failed_client_propagates_to_project_and_entry_without_placeholder_records ... ok1287test importers::harvest::sync_tests::invalid_parent_blocks_dependent_time_but_other_catalog_records_survive ... ok1288test importers::harvest::sync_tests::missing_source_timestamp_keeps_the_previous_watermark ... ok1289test importers::harvest::sync_tests::missing_client_fallback_and_failed_project_savepoints_do_not_poison_cache ... ok1290test importers::harvest::sync_tests::failed_rows_are_available_to_the_next_incremental_retry ... ok1291test importers::harvest::sync_tests::checkpoints::failed_api_preview_publishes_its_last_confirmed_page_report ... ok1292test importers::harvest::sync_tests::paging::durable_api_stale_commit_cannot_advance_data_or_watermark ... ok1293test importers::harvest::sync_tests::checkpoints::durable_api_resumes_committed_pages_and_preserves_the_high_watermark ... ok1294test importers::harvest::sync_tests::checkpoints::failed_api_commit_publishes_its_last_confirmed_page_report ... ok1295test importers::harvest::sync_tests::paging::cancelled_page_consumer_retains_lock_until_worker_exits_and_rolls_back ... ok1296test importers::harvest::sync_tests::checkpoints::durable_api_resumes_after_a_confirmed_parent_batch ... ok1297test importers::harvest::sync_tests::scale::api_100k_commit_and_reimport ... ignored, 100,000-entry scale measurement; run explicitly with --release --nocapture1298test importers::harvest::sync_tests::scale::api_100k_dry_run ... ignored, 100,000-entry scale measurement; run explicitly with --release --nocapture1299test importers::harvest::sync_tests::scale::api_durable_100k_commit_and_reimport ... ignored, 100,000-entry durable API measurement; run explicitly with --release --nocapture1300test importers::harvest::sync_tests::scale::api_durable_100k_dry_run ... ignored, 100,000-entry durable API measurement; run explicitly with --release --nocapture1301test importers::harvest::sync_tests::out_of_range_api_decimals_error_per_row_and_leave_retry_watermark ... ok1302test importers::harvest::sync_tests::checkpoints::durable_api_preview_preserves_adoptions_and_repeated_ids_across_recovery ... ok1303test importers::harvest::sync_tests::refreshed_tokens_survive_a_dry_run_rollback_in_the_same_import_session ... ok1304test importers::harvest::sync_tests::paging::later_download_failure_rolls_back_parents_rows_and_watermark ... ok1305test importers::harvest::sync_tests::parent_catalog_preserves_metadata_and_counts_each_entity_once ... ok1306test importers::harvest::sync_tests::parent_only_api_import_creates_catalog_and_reimport_skips_it ... ok1307test importers::harvest::sync_tests::parent_only_dry_run_previews_without_persisting_catalog ... ok1308test importers::harvest::sync_tests::successful_sync_only_marks_the_incrementally_fetched_entity ... ok1309test init::tests::init_refuses_when_an_organization_exists ... ok1310test importers::harvest::sync_tests::watermark_write_failure_rolls_back_imported_data ... ok1311test init::tests::init_creates_one_org_and_one_admin_and_nothing_else ... ok1312test importers::harvest::sync_tests::watermark_never_passes_the_start_of_capture ... ok1313test importers::harvest::sync_tests::paging::invalid_and_missing_timestamp_rows_cross_page_boundaries_without_advancing ... ok1314test jobs::outbox::tests::acknowledges_confirmed_delivery_without_reclaiming_it ... ok1315test jobs::outbox::tests::invalid_payload_is_not_delivered_and_does_not_leak_into_errors ... ok1316test jobs::outbox::tests::plugin_failure_retries_with_the_same_event_identity ... ok1317test importers::harvest::sync_tests::paging::durable_api_cancel_waits_for_the_producer_before_acknowledging ... ok1318test jobs::report::stream_tests::download_reads_only_when_consumed_and_releases_its_connection ... ok1319test jobs::report::tests::legacy_upgrade_preserves_job_states_and_existing_archives ... ok1320test jobs::tests::cancellation_and_retry_are_scoped_and_idempotent ... ok1321test jobs::report::stream_tests::download_keeps_its_snapshot_when_later_progress_archives_the_inline_tail ... ok1322test jobs::outbox::tests::worker_delivers_available_events_and_stops_cleanly ... ok1323test importers::harvest::sync_tests::scale::durable_measurement_finishes_from_its_eof_checkpoint ... ok1324test jobs::report::tests::report_fragments_survive_until_the_owning_job_expires ... ok1325test jobs::tests::claims_are_atomic_and_expired_leases_recover ... ok1326test importers::harvest::sync_tests::scale::http_pages_preview_commit_and_reimport ... ok1327test jobs::report::stream_tests::download_reports_missing_fragments_after_its_buffered_page ... ok1328test jobs::report::tests::upgrading_legacy_reports_preserves_errors_and_fences_old_attempts ... ok1329test jobs::tests::api_job_keeps_its_policy_across_duplicate_enqueue_and_manual_retry ... ok1330test jobs::tests::concurrent_csv_resubmission_preserves_identity_after_upload_cleanup ... ok1331test jobs::tests::cancellation_survives_a_crash_before_the_worker_acknowledges ... ok1332test jobs::tests::history_paginates_tied_timestamps_and_rejects_foreign_cursors ... ok1333test jobs::tests::failed_csv_preview_retains_confirmed_report_through_history_and_retry ... ok1334test jobs::tests::expired_final_attempt_fails_without_claiming_again ... ok1335test jobs::tests::cleanup_retains_retryable_uploads_and_deletes_expired_jobs ... ok1336test jobs::tests::failed_csv_commit_retains_confirmed_report_through_history_and_retry ... ok1337test jobs::tests::missing_csv_upload_records_error_and_requeues ... ok1338test jobs::tests::invalid_policy_cannot_enqueue_a_job_or_upload ... ok1339test jobs::tests::import_adapters_reject_a_lease_from_another_organization ... ok1340test jobs::tests::outbox_delivery_is_idempotent ... ok1341test jobs::tests::csv_job_persists_its_policy_with_the_upload ... ok1342test jobs::tests::outbox_claims_only_the_requested_event_kind ... ok1343test jobs::tests::payload_kind_is_stable_and_round_trips ... ok1344test jobs::tests::payload_versions_preserve_legacy_jobs_and_reject_unknown_versions ... ok1345test jobs::tests::invalid_stored_payloads_reach_a_terminal_error ... ok1346test jobs::tests::retry_snapshot_does_not_guess_unknown_payloads_or_sources ... ok1347test jobs::tests::retry_snapshot_matches_status_and_list_without_exposing_payload ... ok1348test jobs::tests::shutdown_deadline_drops_and_joins_in_flight_work ... ok1349test jobs::tests::shutdown_waits_for_in_flight_work ... ok1350test jobs::tests::outbox_same_kind_consumers_cannot_claim_the_same_lease ... ok1351test importers::harvest::sync_tests::scale::durable_api_report_preserves_overflow_errors_after_recovery ... ok1352test jobs::tests::cancellation_waits_for_the_claimed_execution_before_allowing_retry ... ok1353test jobs::tests::outbox_rollback_does_not_publish_an_event ... ok1354test jobs::tests::synthetic_job_uses_the_same_registered_envelope ... ok1355test jobs::tests::upload_organization_must_match_its_job ... ok1356test models::project_creation::tests::draft_roundtrip_preserves_incomplete_input_without_demo_data ... ok1357test models::project_creation::tests::unauthorized_catalog_cost_is_absent_from_serialized_options ... ok1358test models::project_creation::tests::unknown_draft_fields_are_rejected ... ok1359test jobs::tests::missing_configuration_records_error_and_requeues ... ok1360test jobs::tests::submission_key_cannot_change_api_mode_or_scope ... ok1361test jobs::tests::submission_key_cannot_change_csv_bytes_or_mode ... ok1362test notifications::tests::disabled_mail_worker_does_not_claim_pending_notifications ... ok1363test notifications::tests::cancelling_delivery_kills_the_active_sender ... ok1364test notifications::tests::mail_configuration_is_disabled_by_default_and_rejects_partial_values ... ok1365test notifications::tests::mail_configuration_requires_an_executable_file_and_safe_sender ... ok1366test jobs::tests::final_failure_is_retained_and_manual_retry_gets_a_new_budget ... ok1367test notifications::tests::recipient_injection_is_rejected_before_starting_a_process ... ok1368test notifications::tests::rendered_mail_bounds_body_lines_for_long_unicode_and_control_names ... ok1369test notifications::tests::foreign_notification_payload_is_terminal_and_never_sent ... ok1370test jobs::tests::reclaimed_attempt_rejects_stale_results_even_with_the_same_worker_name ... ok1371test notifications::tests::revoked_recipient_does_not_receive_a_pending_email ... ok1372test notifications::tests::acknowledged_email_is_never_claimed_again ... ok1373test jobs::tests::synthetic_job_executes_through_claim_and_completion ... ok1374test notifications::tests::failed_email_retries_same_identity_and_eventually_stops ... ok1375test jobs::tests::outbox_stale_claims_cannot_acknowledge_or_reschedule_delivery ... ok1376test pages::clients::filters::tests::clearing_query_preserves_selected_currency_and_lifecycle ... ok1377test pages::clients::filters::tests::lifecycle_counts_share_query_and_currency_filters ... ok1378test pages::clients::filters::tests::name_search_ignores_case_and_surrounding_whitespace ... ok1379test pages::clients::filters::tests::preferred_or_visible_project_currency_matches_but_query_still_applies ... ok1380test pages::clients::form::tests::absent_billing_authority_never_produces_an_edit_payload ... ok1381test pages::clients::form::tests::ambiguous_creation_errors_require_explicit_recovery ... ok1382test pages::clients::form::tests::clearing_a_rate_is_explicit_and_needs_no_currency_confirmation ... ok1383test pages::clients::form::tests::invalid_fields_are_not_rewritten_by_validation ... ok1384test pages::clients::form::tests::rate_replacement_requires_confirmation_in_the_current_currency ... ok1385test pages::clients::form::tests::untouched_fields_keep_zero_rate_and_original_snapshot ... ok1386test pages::importers::presentation::tests::interrupted_report_is_partial_regardless_of_retry_prerequisites ... ok1387test pages::importers::presentation::tests::no_selection_does_not_claim_no_import_history ... ok1388test pages::importers::presentation::tests::source_labels_do_not_guess_unknown_importers ... ok1389test pages::importers::presentation::tests::states_and_phases_have_readable_unknown_fallbacks ... ok1390test pages::importers::presentation::tests::summaries_distinguish_zero_skipped_and_mixed_outcomes ... ok1391test pages::invoices::defaults_form::tests::invoice_fields_bound_metadata_by_characters_and_reject_nul ... ok1392test pages::invoices::defaults_form::tests::invoice_fields_preserve_exact_percentages_and_custom_terms ... ok1393test pages::invoices::defaults_form::tests::invoice_fields_preserve_receipt_terms_and_empty_optional_percentages ... ok1394test pages::invoices::defaults_form::tests::invoice_fields_reject_invalid_percentages_terms_and_second_tax ... ok1395test pages::invoices::preparation::fees::tests::fee_inputs_require_exact_amounts_and_an_explicit_positive_charge ... ok1396test pages::invoices::preparation::fees::tests::refresh_keeps_raw_edits_and_does_not_select_new_sources ... ok1397test pages::invoices::preparation::fees::tests::refresh_preserves_missing_or_relabelled_edits_until_explicit_removal ... ok1398test pages::invoices::preparation::tests::invoice_context_selects_only_the_exact_available_client ... ok1399test pages::invoices::preparation::tests::invoice_review_requires_matching_sources_and_valid_values ... ok1400test pages::invoices::preparation::tests::unavailable_or_malformed_invoice_context_never_uses_the_first_client ... ok1401test pages::new_project::basics::tests::a_batch_that_would_exceed_the_tag_limit_is_rejected ... ok1402test pages::new_project::basics::tests::a_full_tag_list_still_accepts_a_duplicate ... ok1403test pages::new_project::basics::tests::overlong_tags_are_rejected_without_truncation ... ok1404test pages::new_project::basics::tests::tag_length_counts_characters_instead_of_bytes ... ok1405test pages::new_project::basics::tests::tags_trim_and_deduplicate_without_changing_existing_spelling ... ok1406test pages::new_project::billing::tests::budget_errors_target_a_control_that_can_be_corrected ... ok1407test pages::new_project::draft::tests::a_mismatched_acknowledgement_does_not_lose_pending_input ... ok1408test pages::new_project::draft::tests::a_retry_keeps_the_unacknowledged_payload_and_revision ... ok1409test pages::new_project::draft::tests::a_validation_rejection_allows_corrected_input_at_the_same_revision ... ok1410test pages::new_project::draft::tests::an_empty_form_is_not_reported_as_saved ... ok1411test pages::new_project::draft::tests::any_saved_draft_wins_over_context_including_empty_or_matching_client ... ok1412test pages::new_project::draft::tests::context_prefills_only_a_new_form_without_fixing_its_currency ... ok1413test pages::new_project::draft::tests::resuming_preserves_the_server_identity_and_incomplete_fields ... ok1414test pages::new_project::team::tests::adding_everyone_deduplicates_without_replacing_project_overrides ... ok1415test pages::new_project::team::tests::exceeding_the_team_limit_does_not_partially_add_people ... ok1416test pages::new_project::team::tests::removing_a_member_keeps_an_empty_restricted_task_restricted ... ok1417test pages::new_project::tests::a_rejected_creation_can_be_edited_but_an_uncertain_commit_must_be_retried ... ok1418test pages::new_project::tests::only_known_validation_fields_can_target_a_control ... ok1419test pages::projects::budget_display_tests::configured_scopes_sum_without_hiding_an_individual_overrun ... ok1420test pages::projects::budget_display_tests::display_preserves_units_sign_and_large_integer_values ... ok1421test pages::projects::budget_display_tests::tag_filter_matches_identity_without_duplicates_or_name_collisions ... ok1422test pages::projects::budget_display_tests::unallocated_zero_and_overflow_budgets_are_not_conflated ... ok1423test pages::reports::tests::cost_total_uses_organization_currency_across_billing_currencies ... ok1424test pages::reports::tests::mixed_currencies_are_not_added_even_when_the_numbers_would_overflow ... ok1425test pages::reports::tests::monetary_total_overflow_is_visible_instead_of_panicking ... ok1426test pages::reports::tests::redacted_costs_do_not_become_zero_or_partial_totals ... ok1427test pages::reports::tests::single_currency_totals_are_formatted_and_empty_reports_have_no_amount ... ok1428test pages::timesheet::tests::cal_span_day_shows_only_the_anchor_column ... ok1429test pages::timesheet::tests::cal_span_defaults_to_week ... ok1430test pages::timesheet::tests::cal_span_unknown_falls_back_to_week ... ok1431test pages::timesheet::tests::cal_span_url_roundtrips ... ok1432test pages::timesheet::tests::cal_span_week_shows_all_seven_days ... ok1433test pages::timesheet::tests::cal_span_work_week_preserves_date_order_across_weekends ... ok1434test pages::timesheet::tests::cal_span_work_week_shows_monday_to_friday ... ok1435test pages::timesheet::tests::cal_span_work_week_skips_sunday_when_it_is_the_first_column ... ok1436test pages::timesheet::tests::day_col_class_marks_today ... ok1437test pages::timesheet::tests::day_col_class_marks_weekend ... ok1438test pages::timesheet::tests::day_col_class_plain_weekday ... ok1439test pages::timesheet::tests::day_col_class_today_wins_over_weekend ... ok1440test pages::timesheet::tests::invalid_duration_cannot_start_a_timer_save_or_clear_a_cell ... ok1441test pages::timesheet::tests::only_a_blank_duration_can_start_an_eligible_timer ... ok1442test pages::timesheet::tests::timed_lanes_still_widens_overlapping_entries ... ok1443test pages::timesheet::tests::timed_lanes_terminates_on_a_zero_length_entry ... ok1444test pages::timesheet::tests::today_offset_is_none_after_the_week ... ok1445test pages::timesheet::tests::today_offset_is_none_before_the_week ... ok1446test pages::timesheet::tests::today_offset_is_six_on_the_sunday ... ok1447test pages::timesheet::tests::today_offset_is_zero_on_the_monday ... ok1448test pages::timesheet::tests::value_cell_class_empty_wins_over_today ... ok1449test pages::timesheet::tests::value_cell_class_marks_today_when_nonzero ... ok1450test pages::timesheet::tests::weekend_style_follows_the_date_not_the_column_offset ... ok1451test pages::timesheet::tests::weekly_duration_edit_preserves_nine_am_start_notes_and_billability ... ok1452test pages::timesheet::tests::weekly_new_entries_are_untimed_and_explicit_clears_still_work ... ok1453test notifications::tests::stale_email_lease_cannot_start_delivery ... ok1454test notifications::tests::sendmail_failure_does_not_expose_program_output ... ok1455test notifications::tests::mail_worker_delivers_only_its_kind_and_drains_cleanly ... ok1456test notifications::tests::sendmail_receives_fixed_arguments_and_stable_message_identity ... ok1457test notifications::tests::sendmail_timeout_kills_and_reaps_the_child ... FAILED1458test plugin::database::tests::dedicated_reader_is_accepted_but_new_write_grants_are_rejected ... ok1459test jobs::tests::expired_lease_cannot_renew_or_commit_using_an_old_transaction_timestamp ... ok1460test plugin::database::tests::application_database_owner_is_not_a_plugin_identity ... ok1461test notifications::tests::retry_can_recover_without_changing_message_identity ... ok1462test plugin::event::tests::active_transition_fires_only_on_a_real_flip ... ok1463test plugin::event::tests::budget_and_timer_events_serialize ... ok1464test plugin::event::tests::new_events_have_stable_hook_names ... ok1465test plugin::event::tests::project_membership_payload_excludes_private_configuration ... ok1466test plugin::database::tests::reader_accepts_optional_first_party_rounding_helper ... ok1467test plugin::event::tests::role_change_event_carries_previous_role ... ok1468test plugin::event::tests::submission_event_serializes_payload ... ok1469test plugin::event::tests::us2_events_have_stable_hook_names ... ok1470test plugin::host::tests::config_lookup::a_set_key_is_returned ... ok1471test plugin::host::tests::config_lookup::an_unset_key_is_none ... ok1472test plugin::database::tests::project_configuration_is_private_even_when_plugin_grants_are_misconfigured ... ok1473test plugin::database::tests::reader_cannot_execute_security_definer_functions ... ok1474test plugin::database::tests::reader_cannot_have_access_to_credentials ... ok1475test plugin::host::tests::database_tests::unconfigured_sql_never_falls_back_to_application_state ... ok1476test notifications::tests::verbose_sender_output_is_discarded_without_blocking_delivery ... ok1477test plugin::host::tests::response_shaping::error_json_wraps_the_message ... ok1478test plugin::host::tests::response_shaping::http_body_accepts_the_size_limit_and_rejects_larger_responses ... ok1479test plugin::host::tests::response_shaping::http_response_carries_status_and_body ... ok1480test plugin::host::tests::response_shaping::invalid_http_utf8_is_an_error_not_an_empty_success ... ok1481test plugin::host::tests::statement_is_read_only::a_cte_select_is_allowed ... ok1482test plugin::host::tests::statement_is_read_only::a_second_statement_is_rejected ... ok1483test plugin::host::tests::statement_is_read_only::a_single_trailing_semicolon_is_allowed ... ok1484test plugin::host::tests::statement_is_read_only::a_write_hidden_behind_a_comment_is_rejected ... ok1485test plugin::host::tests::statement_is_read_only::plain_select_is_allowed ... ok1486test plugin::host::tests::statement_is_read_only::writes_are_rejected ... ok1487test plugin::host::tests::wrap_select::strips_a_trailing_semicolon_before_wrapping ... ok1488test plugin::host::tests::wrap_select::wraps_as_a_bounded_row_query ... ok1489test plugin::manifest::tests::accepts_all_published_business_events ... ok1490test plugin::manifest::tests::config_defaults_to_empty_when_absent ... ok1491test plugin::manifest::tests::parse_valid_manifest ... ok1492test plugin::manifest::tests::parses_optional_config_table ... ok1493test plugin::manifest::tests::reject_empty_hooks ... ok1494test plugin::manifest::tests::reject_unknown_hook ... ok1495test plugin::host::tests::database_tests::query_discards_session_advisory_locks ... ok1496test plugin::database::tests::reader_cannot_switch_into_another_role ... ok1497test jobs::tests::stopped_worker_leaves_queued_jobs_unclaimed ... ok1498test plugin::host::tests::database_queries_preserve_parameters_and_rollback_session_settings ... ok1499test plugin::database::tests::reader_rejects_unapproved_invoker_functions ... ok1500test plugin::host::tests::database_tests::query_results_are_bounded_without_silent_truncation ... ok15011502running 1 test1503test plugin::host::tests::database_tests::select_cannot_write_or_gain_application_privileges ... ok1504test plugin::registry::tests::initialization::guest_initializers_have_an_engine_instruction_budget ... ok15051506test result: ok. 1 passed; 0 failed; 0 ignored; 0 measured; 839 filtered out; finished in 0.20s150715081509running 1 test1510test plugin::registry::tests::initialization::guest_initializers_have_an_engine_instruction_budget ... ok15111512test result: ok. 1 passed; 0 failed; 0 ignored; 0 measured; 839 filtered out; finished in 0.07s151315141515running 1 test1516test plugin::registry::tests::initialization::guest_initializers_have_an_engine_instruction_budget ... ok15171518test result: ok. 1 passed; 0 failed; 0 ignored; 0 measured; 839 filtered out; finished in 0.17s151915201521running 1 test1522test plugin::registry::tests::initialization::guest_initializers_have_an_engine_instruction_budget ... ok15231524test result: ok. 1 passed; 0 failed; 0 ignored; 0 measured; 839 filtered out; finished in 0.13s15251526test plugin::registry::tests::initialization::guest_initializers_have_an_engine_instruction_budget ... ok1527test plugin::registry::tests::isolation::cancelling_a_waiter_keeps_capacity_reserved_until_the_host_call_exits ... ok1528test plugin::registry::tests::isolation::confirmed_dispatch_attempts_other_plugins_after_one_fails ... ok1529test plugin::registry::tests::isolation::confirmed_dispatch_returns_overload_for_retry ... ok1530test plugin::registry::tests::isolation::confirmed_dispatch_returns_plugin_failure_for_retry ... ok1531test plugin::registry::tests::isolation::confirmed_dispatch_waits_for_the_plugin_to_finish ... ok1532test plugin::registry::tests::isolation::different_plugins_share_the_running_call_limit ... ok1533test plugin::registry::tests::isolation::events_execute_outside_the_async_worker ... ok1534test plugin::registry::tests::isolation::loaded_plugins_cannot_grow_memory_past_the_limit ... ok1535test plugin::registry::tests::isolation::loaded_plugins_cannot_start_with_excessive_memory ... ok1536test plugin::host::tests::database_tests::wasm_host_uses_the_restricted_connection_on_a_current_thread_runtime ... ok1537test plugin::registry::tests::isolation::oversized_wasm_output_is_rejected_before_copying_it ... ok1538test plugin::registry::tests::isolation::pending_capacity_rejects_new_work_without_spawning_tasks ... ok1539test plugin::registry::tests::isolation::widgets_execute_outside_the_async_worker ... ok1540test plugin::registry::tests::load_empty_directory ... ok1541test plugin::registry::tests::load_nonexistent_directory ... ok1542test plugin::registry::tests::isolation::oversized_event_payloads_are_not_queued ... ok1543test render::tests::invoice_template_formats_large_minor_units_exactly ... ok1544test reports::bounded::tests::cancelled_export_keeps_its_slot_until_the_renderer_exits ... ok1545test reports::bounded::tests::export_admission_stays_reserved_until_the_body_is_dropped ... ok1546test reports::bounded::tests::export_rendering_runs_off_the_async_worker ... ok1547test reports::bounded::tests::output_budget_checks_writes_and_seeks_without_truncation ... ok1548test reports::bounded::tests::rendered_output_limit_rejects_oversized_files_and_releases_admission ... ok1549test reports::bounded::tests::renderer_errors_and_panics_release_admission ... ok1550test plugin::host::tests::a_query_cannot_disable_its_own_deadline ... ok1551test reports::bounded::tests::timed_out_export_keeps_its_slot_until_the_renderer_exits ... ok1552test plugin::registry::tests::initialization::instruction_budget_is_replenished_for_each_call ... ok1553test reports::limits::tests::bounded_entries_enforce_the_row_limit_after_all_filters ... ok1554test reports::limits::tests::bounded_entries_reject_large_fields_and_combined_text ... ok1555test reports::limits::tests::bounded_exports_preserve_real_workbooks_and_deterministic_pdf ... ok1556test reports::limits::tests::bounded_invoice_limits_include_branding_and_preserve_tenant_scope ... ok1557test plugin::registry::tests::load_test_plugins ... ok1558test plugin::registry::tests::dispatch_event_with_no_subscribers ... ok1559test plugin::registry::tests::collect_widgets_from_echo_plugin ... ok1560test reports::limits::tests::measure_bounded_export_limits ... ignored, manual release export measurement; set HORAE_EXPORT_PROBE_DIR for artifacts1561test plugin::registry::tests::isolation::a_wasm_timeout_releases_the_worker_and_instance ... ok1562test reports::limits::tests::bounded_projects_filter_archives_before_size_checks ... ok1563test reports::limits::tests::export_size_checks_and_reads_share_a_repeatable_read_snapshot ... ok1564test plugin::registry::tests::failing_plugin_does_not_block_caller ... ok1565test plugin::registry::tests::dispatch_to_echo_plugin_succeeds ... ok1566test reports::streaming::database_tests::measure_streaming_csv_export ... ignored, Manual release measurement of a 100,000-row CSV download1567test plugin::registry::tests::dispatch_invoice_sent_to_echo_plugin ... ok1568test reports::limits::tests::export_queries_are_read_only_and_have_a_database_deadline ... ok1569test reports::limits::tests::tag_filter_applies_before_xlsx_size_checks_and_rendering ... ok1570test reports::limits::tests::invoice_exports_show_saved_adjustments_and_exact_large_amounts ... ok1571test reports::limits::tests::fee_exports_preserve_absent_quantities_and_render_a_real_pdf ... ok1572test reports::streaming::database_tests::streamed_projects_preserve_scope_budget_and_tenant_isolation ... ok1573test reports::streaming::database_tests::streamed_tag_filter_excludes_other_projects_without_duplicating_rows ... ok1574test reports::streaming::tests::completed_csv_keeps_admission_until_body_drop ... ok1575test reports::streaming::tests::csv_backpressure_and_body_drop_bound_and_cancel_source_reads ... ok1576test reports::streaming::tests::csv_does_not_truncate_a_quoted_unicode_record_larger_than_a_chunk ... ok1577test reports::streaming::tests::csv_emits_a_chunk_before_the_source_finishes ... ok1578test reports::streaming::tests::csv_failure_or_panic_after_a_chunk_is_not_successful_eof ... ok1579test reports::streaming::tests::csv_startup_errors_are_http_errors_and_release_admission ... ok1580test reports::streaming::database_tests::dropping_streamed_timesheet_closes_its_database_connection ... ok1581test reports::streaming::tests::dropping_csv_during_startup_cancels_the_producer ... ok1582test route::tests::client_detail_preserves_identity_and_highlights_only_clients ... ok1583test route::tests::client_workflow_paths_preserve_context_and_navigation_section ... ok1584test route::tests::edit_project_preserves_identity_and_highlights_only_projects ... ok1585test route::tests::malformed_context_reaches_the_workflow_for_validation_after_recovery ... ok1586test route::tests::new_project_is_static_and_highlights_only_projects ... ok1587test reports::streaming::database_tests::streamed_timesheet_exceeds_xlsx_row_limit_without_one_large_body_chunk ... ok1588test reports::streaming::tests::csv_timeout_interrupts_an_already_started_body ... ok1589test reports::streaming::database_tests::a_real_database_error_interrupts_the_csv_body ... ok1590test reports::streaming::database_tests::streamed_invoice_uses_stored_exact_cents_and_tenant_scoped_metadata ... ok1591test reports::privacy_tests::unauthorized_project_text_does_not_affect_export_size_limits ... ok1592test seed::tests::concurrent_initializers_cannot_create_two_organizations ... ok1593test seed::tests::concurrent_seed_runs_create_only_one_demo ... ok1594test seed::tests::concurrent_init_and_seed_cannot_mix_organizations ... ok1595test server_fns::approvals::submission_tests::cancelling_a_submission_releases_its_write_barrier ... ok1596test reports::streaming::database_tests::streamed_invoice_metadata_and_lines_share_one_snapshot ... ok1597test server_fns::approvals::submission_tests::submission_accepts_the_organizations_sunday_start ... ok1598test server_fns::approvals::submission_tests::submission_barrier_allows_shared_writers_for_the_same_user ... ok1599test reports::streaming::database_tests::streamed_fee_invoice_has_no_fabricated_hours_or_hourly_rate ... ok1600test server_fns::approvals::submission_tests::submission_does_not_wait_for_another_users_writer ... ok1601test server_fns::approvals::submission_tests::submission_freezes_the_minutes_after_a_competing_edit ... ok1602test seed::tests::seed_refuses_a_second_organization_even_when_the_demo_exists ... ok1603test server_fns::approvals::submission_tests::submission_rejects_a_start_that_is_not_the_organizations_week_start ... ok1604test server_fns::approvals::submission_tests::submission_uses_one_pool_connection ... ok1605test server_fns::approvals::tests::sees_a_running_timer_inside_the_week ... ok1606test seed::tests::seed_refuses_an_initialized_organization_without_writes ... ok1607test server_fns::approvals::tests::ignores_stopped_and_out_of_week_timers ... ok1608test server_fns::approvals::submission_tests::submission_waits_for_a_new_timer_before_checking_the_week ... ok1609test server_fns::budget_tests::budget_notification_schema_enforces_tenants_and_no_public_access ... ok1610test server_fns::budget_tests::configured_alerts_deduplicate_concurrent_checks_and_recrossing ... ok1611test server_fns::budget_tests::configured_alert_recipients_are_active_same_org_managers_and_project_leads ... ok1612test server_fns::budget_tests::configured_alert_and_outbox_roll_back_together ... ok1613test server_fns::budget_tests::concurrent_budget_checks_have_one_band_claimant ... ok1614test reports::privacy_tests::project_downloads_follow_progress_visibility ... ok1615test server_fns::budget_tests::configured_amount_budget_uses_resolved_rates_and_explicit_zero ... ok1616test server_fns::budget_tests::configured_budget_sweep_recovers_missed_checks_without_duplicates ... ok1617test seed::tests::late_seed_failure_rolls_back_all_demo_data ... ok1618test server_fns::budget_tests::configured_monthly_budget_includes_leap_day_and_preserves_locked_rounding ... ok1619test server_fns::budget_tests::configured_budget_does_not_read_foreign_or_legacy_projects ... ok1620test server_fns::budget_tests::configured_monthly_budget_excludes_other_months_and_nonbillable_time ... ok1621test server_fns::budget_tests::configured_alerts_require_enabled_active_project_and_authorized_recipient ... ok1622test server_fns::budget_tests::configured_nonbillable_projects_count_time_without_hidden_checkbox ... ok1623test server_fns::budget_tests::configured_person_budget_excludes_other_people_and_has_its_own_alert ... ok1624test server_fns::budget_tests::overview_budget_progress_batches_projects_without_mixing_scopes ... ok1625test seed::tests::seed_leaves_an_older_or_partial_demo_unchanged ... ok1626test server_fns::budget_tests::configured_task_fee_budget_respects_billability_and_alert_scope ... ok1627test server_fns::budget_tests::overview_budget_progress_is_current_period_scoped_and_authorized ... ok1628test server_fns::budget_tests::overview_budget_progress_includes_people_without_an_allowance ... ok1629test server_fns::budget_tests::configured_task_and_person_budgets_do_not_share_consumption ... ok1630test server_fns::clients::tests::client_details_distinguish_unset_zero_and_positive_manager_rates ... ok1631test server_fns::clients::tests::client_details_hide_foreign_missing_and_inactive_actor_records ... ok1632test server_fns::clients::tests::client_invoices_keep_exact_client_scope_statuses_and_currencies ... ok1633test seed::tests::repeated_seed_preserves_every_row_and_user_edits ... ok1634test server_fns::clients::tests::client_default_rate_allows_detail_edits_and_equivalent_currency ... ok1635test server_fns::clients::tests::client_default_rate_prevents_currency_relabelling ... ok1636test server_fns::clients::tests::client_details_keep_catalog_identity_but_omit_member_billing ... ok1637test server_fns::clients::tests::both_activation_transitions_change_once_and_preserve_details ... ok1638test server_fns::clients::tests::client_invoices_hold_authority_until_the_read_finishes ... ok1639test server_fns::clients::tests::client_summaries_reject_a_foreign_actor_even_when_client_org_is_known ... ok1640test server_fns::clients::tests::client_summaries_follow_existing_progress_visibility_and_revoke_inactive_users ... ok1641test server_fns::clients::tests::currency_edit_rechecks_a_concurrently_added_client_default_rate ... ok1642test reports::streaming::database_tests::streamed_timesheet_preserves_csv_escaping_frozen_zero_and_all_filters ... ok1643test server_fns::clients::tests::concurrent_deletion_is_not_an_unchanged_mutation ... ok1644test server_fns::clients::tests::client_summaries_keep_catalog_without_projects_and_count_archived_projects ... ok1645test server_fns::clients::tests::client_invoices_reject_a_winning_concurrent_revocation ... ok1646test server_fns::clients::tests::client_invoices_require_manager_authority_even_without_invoices ... ok1647test server_fns::clients::tests::client_summaries_exclude_foreign_clients_and_unreadable_project_currencies ... ok1648test server_fns::clients::tests::profile_currency_change_without_a_rate_keeps_it_unset ... ok1649test server_fns::clients::tests::profile_saves_reject_invalid_input_without_partial_writes ... ok1650test server_fns::clients::tests::missing_and_foreign_clients_are_not_noops ... ok1651test server_fns::clients::tests::profile_noop_preserves_row_and_returns_no_update_event_signal ... ok1652test server_fns::clients::tests::profile_create_persists_normalized_identity_and_exact_optional_rate ... ok1653test server_fns::clients::tests::profile_update_preserves_historical_rows_and_inactive_status ... ok1654test server_fns::clients::tests::profile_update_rechecks_financial_snapshot_after_waiting_for_a_concurrent_edit ... ok1655test server_fns::clients::tests::each_field_changes_once_and_preserves_inactive_status ... ok1656test server_fns::clients::tests::profile_update_rechecks_authority_after_waiting_for_a_concurrent_demotion ... ok1657test server_fns::clients::tests::profile_saves_recheck_manager_org_and_active_actor ... ok1658test server_fns::importers::authorization_tests::cli_job_endpoints_have_stable_registered_paths ... ok1659test server_fns::clients::tests::unchanged_activation_preserves_the_row ... ok1660test server_fns::importers::authorization_tests::request_bound_import_endpoints_are_not_registered ... ok1661test server_fns::importers::csv_upload::tests::csv_upload_extractor_preserves_raw_bytes ... ok1662test server_fns::importers::csv_upload::tests::csv_upload_requires_its_header_without_reading_the_body ... ok1663test server_fns::importers::tests::concurrent_api_import_returns_a_retryable_conflict ... ok1664test server_fns::importers::tests::csv_route_rejects_invalid_modes_and_headers_without_reading_uploads ... ok1665test server_fns::importers::tests::submission_identity_rejects_expired_future_and_non_v7_keys ... ok1666test server_fns::clients::tests::profile_update_rejects_stale_rate_even_when_the_target_currency_is_unchanged ... ok1667test server_fns::clients::tests::unchanged_edit_preserves_the_row ... ok1668test server_fns::clients::tests::restoring_values_after_a_competing_edit_reports_a_change ... ok1669test server_fns::clients::tests::profile_update_rejects_stale_currency_even_when_the_rate_is_still_unset ... ok1670test server_fns::clients::tests::restoring_a_competing_deactivation_reports_reactivation ... ok1671test server_fns::clients::tests::repeating_a_competing_edit_does_not_report_a_change ... ok1672test server_fns::clients::tests::profile_update_requires_explicit_rate_intent_for_currency_changes ... ok1673test server_fns::clients::tests::repeating_a_competing_deactivation_does_not_report_a_transition ... ok1674test server_fns::invoices::fee_tests::fee_invoice_does_not_claim_hours_or_another_clients_fee ... ok1675test server_fns::invoices::fee_tests::concurrent_invoices_claim_a_single_fee_once ... ok1676test server_fns::invoices::fee_tests::fee_occurrence_rejects_cross_organization_project ... ok1677test server_fns::importers::authorization_tests::job_endpoints_enforce_session_role_and_organization ... ok1678test server_fns::invoices::fee_tests::fee_total_overflow_rolls_back_occurrences_and_invoice ... ok1679test server_fns::invoices::fee_tests::draft_fee_edit_rejects_invalid_lines_and_current_unauthorized_actors ... ok1680test server_fns::invoices::fee_tests::invoice_line_sources_reject_mixed_sources_and_invented_fee_quantities ... ok1681test server_fns::invoices::fee_tests::fee_preview_keeps_source_identity_and_reports_discounted_draft_balances ... ok1682test server_fns::invoices::fee_tests::concurrent_discounted_invoice_retries_return_one_invoice ... ok1683test server_fns::invoices::fee_tests::milestones_include_unbilled_overdue_fees_but_not_future_fees ... ok1684test server_fns::invoices::fee_tests::discounted_fee_leaves_a_balance_and_void_releases_only_its_contribution ... ok1685test server_fns::invoices::fee_tests::monthly_fees_use_calendar_dates_and_skip_already_claimed_months ... ok1686test server_fns::invoices::fee_tests::fee_preview_discount_ties_follow_source_keys_not_display_dates ... ok1687test server_fns::invoices::fee_tests::monthly_first_and_fifteenth_respect_partial_period_and_project_end ... ok1688test server_fns::invoices::fee_tests::invoice_status_rechecks_authority_after_waiting_for_the_invoice_lock ... ok1689test server_fns::invoices::fee_tests::mixed_time_and_fee_discount_conserves_cents_without_reopening_time ... ok1690test server_fns::invoices::fee_tests::invoice_defaults_apply_to_selected_fees_without_claiming_other_projects ... ok1691test server_fns::invoices::fee_tests::invoice_preview_does_not_materialize_fees_and_preserves_released_snapshots ... ok1692test server_fns::invoices::fee_tests::draft_fee_edit_serializes_retries_and_rejects_stale_revisions ... ok1693test server_fns::invoices::fee_tests::removing_discount_and_billing_the_remainder_cannot_both_succeed ... ok1694test server_fns::invoices::fee_tests::reviewed_generation_bills_partial_fees_and_rejects_stale_balances ... ok1695test server_fns::invoices::fee_tests::draft_fee_edit_replaces_amount_and_preserves_source_and_retry_identity ... ok1696test server_fns::invoices::fee_tests::single_fee_can_be_invoiced_without_time ... ok1697test server_fns::invoices::fee_tests::reviewed_generation_rejects_changed_time_before_claiming_it ... ok1698test server_fns::invoices::fee_tests::void_releases_fee_identity_without_rewriting_the_original_line ... ok1699test server_fns::invoices::preview::tests::excess_rejects_an_unrepresentable_total_even_when_the_remainder_fits ... ok1700test server_fns::invoices::preview::tests::unselected_fee_currencies_do_not_relabel_or_block_selected_charges ... ok1701test server_fns::invoices::fee_tests::reviewed_generation_requires_exact_excess_and_current_authority ... ok1702test server_fns::invoices::fee_tests::fee_balance_migration_allocates_discount_without_rewriting_invoice_snapshots ... ok1703test server_fns::invoices::tests::configured_fixed_fee_hours_are_not_invoiced_but_legacy_fees_are_unchanged ... ok1704test server_fns::invoices::tests::billing_cascade_agrees_across_all_four_levels_including_zero ... ok1705test server_fns::invoices::tests::effective_minutes_migration_preserves_historical_invoice_quantities ... ok1706test server_fns::invoices::tests::configured_project_currency_and_cost_override_keep_their_denominations ... ok1707test server_fns::invoices::fee_tests::project_fee_context_keeps_monthly_balances_separate ... ok1708test server_fns::invoices::fee_tests::zero_fee_is_invoiced_once_until_voided ... ok1709test server_fns::invoices::fee_tests::draft_fee_edit_requires_current_balance_and_exact_excess_confirmation ... ok1710test server_fns::invoices::tests::effective_minutes_sql_matches_domain_rounding ... ok1711test server_fns::invoices::fee_tests::prepared_fee_selection_rejects_invalid_values_and_empty_generation ... ok1712test server_fns::invoices::tests::imported_rates::imported_legacy_project_keeps_exact_rates_and_totals_on_retry ... ok1713test server_fns::invoices::tests::invoice_defaults_apply_exact_adjustments_and_payment_terms ... ok1714test server_fns::invoices::fee_tests::settled_fee_sources_remain_reviewable_without_automatic_charges ... ok1715test server_fns::invoices::tests::invoice_defaults_validate_all_override_fields ... ok1716test server_fns::invoices::tests::invoice_line_overflow_leaves_time_unbilled ... ok1717test server_fns::invoices::tests::imported_rates::rejected_import_rate_does_not_poison_the_next_row_or_its_catalog_rate ... ok1718test server_fns::invoices::tests::invoice_defaults_legacy_insert_preserves_dates_and_exact_total ... ok1719test server_fns::invoices::tests::invoice_defaults_selection_rejects_unavailable_projects_before_claiming ... ok1720test server_fns::invoices::tests::invoice_defaults_are_invoice_owned_and_only_drafts_are_editable ... ok1721test server_fns::invoices::tests::invoice_total_overflow_leaves_all_time_unbilled ... ok1722test server_fns::invoices::tests::invoice_defaults_edit_rechecks_status_after_waiting_for_a_concurrent_send ... ok1723test server_fns::invoices::tests::invoice_transitions_reject_invalid_states_and_foreign_organizations ... ok1724test server_fns::invoices::tests::invoiced_amounts_survive_rate_changes_and_void_uses_current_rates ... ok1725test server_fns::invoices::tests::invoicing_leaves_running_time_open ... ok1726test server_fns::invoices::tests::invoiced_billability_survives_later_project_changes ... ok1727test server_fns::invoices::tests::invoice_preview_rejects_large_results_instead_of_truncating_them ... ok1728test server_fns::invoices::tests::large_invoice_and_reports_agree_without_intermediate_overflow ... ok1729test server_fns::invoices::tests::invoicing_uses_and_freezes_effective_minutes ... ok1730test server_fns::invoices::tests::mixed_project_currencies_cannot_partially_create_an_invoice ... ok1731test server_fns::invoices::tests::invoice_preview_matches_generation_without_claiming_time ... ok1732test server_fns::invoices::tests::only_running_time_does_not_create_an_invoice ... ok1733test server_fns::invoices::tests::project_rate_is_used_by_invoices_reports_and_spend ... ok1734test server_fns::invoices::tests::non_billable_context_produces_no_unbilled_amount_on_any_report ... ok1735test server_fns::invoices::fee_tests::project_fee_context_matches_invoice_balances_and_current_authority ... ok1736test server_fns::invoices::tests::selected_project_rate_modes_agree_across_billing_consumers ... ok1737test server_fns::invoices::tests::void_waits_for_a_concurrent_payment_and_then_refuses ... ok1738test server_fns::invoices::tests::void_reopens_time_without_stale_rounding ... ok1739test server_fns::organization::tests::each_branding_field_changes_once_including_null_and_empty ... ok1740test server_fns::organization::tests::missing_organization_is_not_an_unchanged_update ... ok1741test server_fns::invoices::fee_tests::reviewed_generation_does_not_materialize_unselected_months ... ok1742test server_fns::organization::tests::repeating_a_competing_branding_edit_does_not_report_a_change ... ok1743test server_fns::organization::tests::restoring_branding_after_a_competing_edit_reports_a_change ... ok1744test server_fns::organization::tests::unchanged_branding_preserves_the_row ... ok1745test server_fns::invoices::tests::invoice_preview_keeps_time_rates_and_defaults_in_one_snapshot ... ok1746test server_fns::invoices::tests::invoice_preview_requires_explicit_resolution_and_scopes_selected_projects ... ok1747test server_fns::invoices::tests::invoice_defaults_conflict_rolls_back_all_claims ... ok1748test server_fns::permissions::storage_tests::additive_migration_preserves_populated_legacy_records ... ok1749test server_fns::permissions::storage_tests::person_state_rejects_duplicates_and_foreign_users_and_templates ... ok1750test server_fns::permissions::storage_tests::storage_does_not_activate_or_infer_legacy_roles ... ok1751test server_fns::permissions::storage_tests::template_names_are_case_insensitive_and_tenant_local ... ok1752test server_fns::project_creation::assignment_tests::finalization_reuses_catalog_and_keeps_lead_overrides_local_on_retry ... ok1753test server_fns::permissions::storage_tests::malformed_stored_grants_fail_without_repair ... ok1754test server_fns::project_creation::assignment_tests::invalid_assignment_graphs_leave_no_partial_creation_or_draft_change ... ok1755test server_fns::project_creation::editing::tests::concurrent_edits_have_one_winner_and_association_writes_invalidate_open_forms ... ok1756test server_fns::permissions::storage_tests::source_shape_and_revision_constraints_reject_invalid_rows ... ok1757test server_fns::project_creation::editing::tests::editor_keeps_archived_selected_identities_and_nullable_overrides ... ok1758test server_fns::project_creation::editing::tests::editing_milestones_keeps_invoice_snapshots_and_fee_identities_immutable ... ok1759test server_fns::project_creation::editing::tests::editor_loads_legacy_values_without_fabricating_a_billing_mode_or_draft ... ok1760test server_fns::project_creation::editing::tests::editor_rechecks_tenant_role_and_active_status ... ok1761test server_fns::project_creation::editing::tests::editor_preserves_fee_schedule_and_operational_milestone_ids ... ok1762test server_fns::invoices::tests::imported_rates::imported_task_rates_require_matching_currency_only_for_new_configured_links ... ok1763test server_fns::project_creation::editing::tests::editor_recovers_full_configuration_and_redacts_private_values_after_role_change ... ok1764test server_fns::project_creation::editing::tests::editor_recovers_each_budget_scope_without_turning_absence_into_zero ... ok1765test server_fns::project_creation::editing::tests::foreign_actor_cannot_save_or_retry_another_organizations_edit ... ok1766test server_fns::permissions::storage_tests::person_grants_and_identity_round_trip_independently_of_source ... ok1767test server_fns::project_creation::editing::tests::manager_edit_preserves_private_settings_and_cannot_remove_them_indirectly ... ok1768test server_fns::project_creation::editing::tests::save_edits_the_same_legacy_project_and_never_creates_a_draft_or_configuration ... ok1769test server_fns::project_creation::editing::tests::task_catalog_and_graph_changes_roll_back_together_on_duplicate_resolution ... ok1770test server_fns::project_creation::editing::tests::save_preserves_recorded_time_and_rejects_removing_its_task_or_person ... ok1771test server_fns::project_creation::editing::tests::saves_recheck_current_authority_and_do_not_repeat_noops ... ok1772test server_fns::project_creation::editing::tests::save_updates_configured_sections_atomically_and_rejects_stale_or_invalid_edits ... ok1773test server_fns::project_creation::editing::tests::editor_load_uses_current_role_across_all_billing_configurations ... ok1774test server_fns::project_creation::tests::creation_actor_is_revalidated_inside_the_transaction ... ok1775test server_fns::project_creation::tests::creation_client_must_be_active_and_in_the_same_organization ... ok1776test server_fns::permissions::storage_tests::unicode_name_collision_rolls_back_migration_without_changing_profiles ... ok1777test server_fns::project_creation::tests::billing_schema_rejects_partial_fee_schedules ... ok1778test server_fns::project_creation::tests::client_dialog_validates_details_and_persists_an_explicit_zero_rate ... ok1779test server_fns::permissions::storage_tests::concurrent_equivalent_names_create_only_one_template ... ok1780test server_fns::project_creation::tests::draft_schema_enforces_one_current_draft_per_creator ... ok1781test server_fns::project_creation::tests::creation_options_are_scoped_bounded_and_redact_manager_costs ... ok1782test server_fns::project_creation::tests::draft_schema_rejects_foreign_creator_and_completed_project ... ok1783test server_fns::project_creation::tests::draft_ownership_discard_and_role_changes_are_enforced ... ok1784test server_fns::project_creation::tests::draft_save_retries_do_not_overwrite_a_newer_revision ... ok1785test server_fns::project_creation::tests::final_validation_preserves_exact_budgets_and_rejects_unavailable_email ... ok1786test server_fns::project_creation::tests::final_validation_checks_invoice_defaults_and_scoped_budget_totals ... ok1787test server_fns::project_creation::tests::final_validation_requires_complete_fee_schedules_and_distinct_entities ... ok1788test server_fns::project_creation::tests::final_validation_requires_real_details_and_ignores_hidden_type_settings ... ok1789test server_fns::project_creation::tests::draft_validation_preserves_incomplete_input_but_bounds_its_size ... ok1790test server_fns::project_creation::tests::existing_projects_have_no_implicit_new_billing_configuration ... ok1791test server_fns::project_creation::tests::managers_cannot_store_administrator_notes_or_costs_in_a_draft ... ok1792test server_fns::project_creation::tests::finalization_rechecks_client_role_revision_and_rate_currency ... ok1793test server_fns::project_creation::tests::draft_schema_rejects_oversize_payload_and_invalid_revision ... ok1794test server_fns::project_creation::tests::finalization_persists_task_access_and_project_only_financial_overrides ... ok1795test server_fns::project_creation::tests::finalize_is_atomic_and_repeated_submission_returns_one_project ... ok1796test server_fns::project_creation::import_tests::imported_catalog_rate_cannot_be_relabelled_as_workspace_currency ... ok1797test server_fns::project_creation::validation::tests::assignment_rejections_identify_the_invalid_row ... ok1798test server_fns::project_creation::validation::tests::basic_rejections_identify_the_field_without_echoing_input ... ok1799test server_fns::project_creation::validation::tests::billing_rejections_identify_the_active_control ... ok1800test server_fns::project_creation::validation::tests::inactive_billing_inputs_remain_in_the_draft_without_blocking_creation ... ok1801test server_fns::project_creation::validation::tests::invoice_rejections_identify_the_field_without_echoing_input ... ok1802test server_fns::project_creation::validation::tests::milestone_rejections_target_the_invalid_row_by_identity ... ok1803test server_fns::project_creation::validation::tests::non_billable_projects_ignore_hidden_invoice_inputs ... ok1804test server_fns::project_creation::validation::tests::task_name_and_access_rejections_identify_the_invalid_row ... ok1805test server_fns::project_creation::tests::invalid_task_rolls_back_project_and_keeps_the_draft ... ok1806test server_fns::projects::bulk_tests::bulk_accepts_one_hundred_projects_and_mixed_status_noops ... ok1807test server_fns::project_creation::tests::selected_client_lookup_is_scoped_and_keeps_archived_identity ... ok1808test server_fns::projects::bulk_tests::bulk_ids_validate_before_writes_and_normalize_duplicates ... ok1809test server_fns::project_creation::tests::selected_catalog_bounds_requests_and_excludes_inactive_people ... ok1810test server_fns::project_creation::tests::missing_draft_responses_do_not_disclose_foreign_ownership ... ok1811test server_fns::projects::bulk_tests::bulk_database_failure_rolls_back_earlier_changes ... ok1812test server_fns::project_creation::tests::simultaneous_draft_updates_have_one_winner ... ok1813test server_fns::permissions::storage_tests::referenced_template_deletion_requires_detaching_without_grant_or_identity_loss ... ok1814test server_fns::project_creation::tests::selected_catalog_is_scoped_deduplicated_and_redacts_manager_costs ... ok1815test server_fns::projects::bulk_tests::bulk_missing_or_foreign_project_rolls_back_earlier_changes ... ok1816test server_fns::projects::bulk_tests::bulk_status_preserves_details_history_and_noop_versions ... ok1817test server_fns::projects::bulk_tests::bulk_preserves_invoiced_history_assignments_and_spend ... ok1818test server_fns::projects::mutation_tests::project::both_activation_transitions_preserve_details_and_change_once ... ok1819test server_fns::projects::bulk_tests::bulk_reversed_overlapping_batches_finish_without_deadlock ... ok1820test server_fns::projects::mutation_tests::project::configured_edits_preserve_non_hourly_billing ... ok1821test server_fns::projects::mutation_tests::project::budgets_and_rates_distinguish_null_zero_and_normalized_values ... ok1822test server_fns::projects::mutation_tests::project::concurrent_deletion_is_rejected_by_both_mutations ... ok1823test server_fns::projects::mutation_tests::project::configured_edits_recheck_settings_after_waiting_for_the_project ... ok1824test server_fns::projects::mutation_tests::project::configured_edits_preserve_compatible_changes_and_idempotence ... ok1825test server_fns::project_creation::import_tests::imports_preserve_finalized_project_configuration_and_restricted_access ... ok1826test server_fns::projects::mutation_tests::project::missing_and_foreign_rows_are_not_noops ... ok1827test server_fns::projects::mutation_tests::project::inactive_project_edits_preserve_identity_and_reject_implicit_migrations ... ok1828test server_fns::projects::mutation_tests::project::invalid_project_fields_leave_the_row_unchanged ... ok1829test server_fns::projects::mutation_tests::project::configured_edits_reject_incompatible_financial_changes_atomically ... ok1830test server_fns::permissions::storage_tests::unicode_name_migration_preserves_existing_templates ... ok1831test server_fns::projects::mutation_tests::project::unchanged_activation_preserves_the_row ... ok1832test server_fns::projects::mutation_tests::project::repeating_a_competing_edit_requires_a_fresh_revision ... ok1833test server_fns::projects::mutation_tests::project::repeating_a_competing_deactivation_reports_no_transition ... ok1834test server_fns::projects::mutation_tests::project::restoring_a_competing_edit_does_not_overwrite_the_other_session ... ok1835test server_fns::projects::mutation_tests::project::restoring_a_competing_deactivation_reports_reactivation ... ok1836test server_fns::projects::mutation_tests::project::unchanged_edit_preserves_the_row ... ok1837test server_fns::projects::mutation_tests::task::repeating_a_competing_deactivation_reports_no_transition ... ok1838test server_fns::projects::mutation_tests::task::concurrent_deletion_returns_not_found_for_both_mutations ... ok1839test server_fns::projects::mutation_tests::task::each_detail_field_changes_once_and_preserves_inactive_status ... ok1840test server_fns::projects::mutation_tests::task::both_activation_transitions_preserve_details_and_change_once ... ok1841test server_fns::projects::details_tests::project_details_and_tags_follow_current_progress_and_private_permissions ... ok1842test server_fns::projects::mutation_tests::task::rate_edits_set_currency_without_relabelling_renames_or_noops ... ok1843test server_fns::projects::mutation_tests::task::missing_and_foreign_rows_are_not_noops ... ok1844test server_fns::projects::mutation_tests::task::unchanged_activation_preserves_the_row ... ok1845test server_fns::projects::details_tests::unlinked_and_private_project_tags_do_not_leak_into_filters ... ok1846test server_fns::projects::mutation_tests::task::restoring_a_competing_edit_reports_a_change ... ok1847test server_fns::projects::mutation_tests::task::restoring_a_competing_deactivation_reports_reactivation ... ok1848test server_fns::projects::mutation_tests::task::repeating_a_competing_edit_does_not_report_a_change ... ok1849test server_fns::projects::mutation_tests::task::unchanged_edit_preserves_the_row ... ok1850test server_fns::projects::privacy_tests::outsiders_and_inactive_viewers_have_no_project_reads ... ok1851test server_fns::projects::privacy_tests::legacy_members_retain_progress_without_new_settings ... ok1852test server_fns::projects::privacy_tests::client_project_filter_preserves_progress_access_and_rate_redaction ... ok1853test server_fns::projects::tests::enabling_tasks_accepts_exact_project_currency_rates_and_preserves_existing_links ... ok1854test server_fns::projects::tests::assignments_are_scoped_to_the_viewers_organization ... ok1855test server_fns::projects::privacy_tests::project_reads_use_current_authority_and_reject_foreign_scope ... ok1856test server_fns::projects::tests::enabling_is_tenant_scoped_even_for_existing_links_and_preserves_overrides ... ok1857test server_fns::projects::privacy_tests::private_progress_does_not_prevent_tracking_or_reveal_financial_fields ... ok1858test server_fns::projects::tests::creating_a_project_task_enables_it_with_its_defaults ... ok1859test server_fns::projects::privacy_tests::project_members_and_leads_receive_progress_without_rates ... ok1860test server_fns::projects::tests::project_rate_distinguishes_inheritance_zero_and_exact_amounts ... ok1861test server_fns::projects::privacy_tests::revoked_membership_preserves_only_own_historical_tracking_identity ... ok1862test server_fns::projects::details_tests::project_details_only_offer_task_rate_currency_to_current_managers ... ok1863test server_fns::projects::tests::enabling_tasks_only_inherits_rates_used_by_configured_projects ... ok1864test server_fns::projects::tests::enabling_tasks_rejects_incompatible_catalog_currency ... ok1865test server_fns::projects::tests::enabling_tasks_rejects_explicit_rates_unused_by_the_project ... ok1866test server_fns::projects::tests::enabling_tasks_rejects_invalid_or_wrong_currency_explicit_rates_without_linking ... ok1867test server_fns::projects::tests::managers_and_admins_can_read_assignment_rates ... ok1868test server_fns::projects::tests::members_can_list_identities_but_not_assignment_rates ... ok1869test server_fns::projects::tests::project_rate_sql_matches_rust_for_missing_zero_and_present_sources ... ok1870test server_fns::projects::tests::project_rate_helper_has_no_public_execute_grant ... ok1871test server_fns::projects::tests::failed_project_task_creation_leaves_no_orphan_task ... ok1872test server_fns::projects::tests::unknown_catalog_currency_requires_explicit_configured_rates_but_preserves_legacy ... ok1873test server_fns::time_entries::tests::a_limit_bounds_a_listing_on_its_own ... ok1874test server_fns::reports::tests::filters_and_renames_keep_report_identity_and_totals ... ok1875test server_fns::time_entries::tests::an_unlimited_listing_needs_both_ends_of_the_range ... ok1876test server_fns::time_entries::tests::a_running_timer_cannot_be_moved_to_another_day ... ok1877test server_fns::time_entries::tests::clamps_duration_against_the_snapped_start ... ok1878test server_fns::time_entries::tests::assigned_member_may_log_time ... ok1879test server_fns::time_entries::tests::admin_may_log_time_without_assignment ... ok1880test server_fns::time_entries::tests::an_open_entry_can_move_into_a_day_with_locked_time ... ok1881test server_fns::time_entries::tests::a_reorder_rejects_foreign_missing_timed_and_duplicate_ids ... ok1882test server_fns::reports::tests::manager_report_omits_groups_containing_private_project_costs ... ok1883test server_fns::time_entries::tests::edits_preserve_archived_time_but_cannot_override_non_billability ... ok1884test server_fns::time_entries::tests::new_time_and_picker_require_a_project_task_link ... ok1885test server_fns::time_entries::tests::rejects_out_of_range_start ... ok1886test server_fns::reports::tests::report_uses_current_active_actor_and_tenant_for_every_filter ... ok1887test server_fns::time_entries::tests::snaps_unaligned_start_to_the_grid ... ok1888test server_fns::time_entries::tests::moving_locked_time_rejects_the_entire_reorder ... ok1889test server_fns::time_entries::tests::inactive_project_cannot_accept_new_time_even_for_admin ... ok1890test server_fns::time_entries::tests::untimed_start_is_left_untouched ... ok1891test server_fns::time_entries::tests::new_time_and_picker_reject_inactive_or_foreign_contexts ... ok1892test server_fns::time_entries::tests::concurrent_timer_starts_insert_exactly_one_entry ... ok1893test server_fns::time_entries::update_tests::concurrent_lock_or_delete_is_rechecked_before_editing ... ok1894test server_fns::time_entries::tests::submission_barrier_blocks_manual_entries_and_timer_starts ... ok1895test server_fns::time_entries::update_tests::competing_identical_edit_is_a_noop_after_the_first_commit ... ok1896test server_fns::reports::tests::same_names_keep_separate_groups_for_every_dimension ... ok1897test server_fns::time_entries::tests::submission_barrier_blocks_edits_and_cross_week_reorders ... ok1898test server_fns::time_entries::tests::new_time_uses_effective_billability_for_manual_entries_and_timers ... ok1899test server_fns::time_entries::update_tests::competing_edit_that_restores_old_values_still_reports_a_change ... ok1900test server_fns::time_entries::tests::unassigned_member_is_forbidden ... ok1901test server_fns::time_entries::update_tests::each_editable_field_changes_once_including_nulls ... ok1902test server_fns::time_entries::update_tests::normalized_noop_preserves_the_row_and_updated_at ... ok1903test server_fns::time_entries::update_tests::effective_billability_noop_preserves_the_row ... ok1904test server_fns::time_entries::update_tests::restricted_empty_task_rejects_changes_and_noop_edits ... ok1905test server_fns::time_entries::update_tests::restricted_empty_task_rejects_picker_manual_and_timer_starts ... ok1906test server_fns::time_entries::update_tests::missing_foreign_and_locked_entries_are_not_noops ... ok1907test server_fns::time_entries::update_tests::restricted_reordering_rejects_the_whole_batch ... ok1908test server_fns::reports::tests::shared_person_and_task_are_partitioned_by_currency ... ok1909test server_fns::time_entries::update_tests::restricted_task_rejects_reschedule_and_delete ... ok1910test server_fns::time_entries::update_tests::task_grant_revocation_committed_during_an_edit_is_rechecked ... ok1911test server_fns::users::tests::concurrency::access_changes_cannot_target_another_organization ... ok1912test server_fns::time_entries::update_tests::restriction_changes_are_rechecked_before_manual_or_timer_insertion ... ok1913test server_fns::users::tests::concurrency::concurrent_deactivations_keep_an_active_admin ... ok1914test server_fns::reports::tests::tag_filters_keep_report_dimensions_and_details_in_sync ... ok1915test server_fns::users::tests::hide_rates_clears_both_rate_fields ... ok1916test server_fns::time_entries::update_tests::revoked_grant_does_not_trap_an_own_running_timer ... ok1917test server_fns::users::tests::concurrency::concurrent_demotions_keep_an_active_admin ... ok1918test server_fns::time_entries::update_tests::task_grants_allow_tracking_and_archived_history_for_every_role ... ok1919test server_fns::time_entries::update_tests::revoked_timer_stop_preserves_the_open_state_guard ... ok1920test server_fns::users::tests::concurrency::deactivation_and_demotion_keep_an_active_admin ... ok1921test server_fns::users::tests::concurrency::the_last_admin_cannot_be_demoted_or_deactivated ... ok1922test server_fns::users::tests::concurrency::demotion_and_deactivation_keep_an_active_admin ... ok1923test server_fns::users::tests::concurrency::unchanged_admin_access_is_allowed ... ok19241925failures:19261927---- notifications::tests::sendmail_timeout_kills_and_reaps_the_child stdout ----19281929thread 'notifications::tests::sendmail_timeout_kills_and_reaps_the_child' (90902501) panicked at crates/horae/src/notifications/tests.rs:35:80:1930called `Result::unwrap()` on an `Err` value: Os { code: 2, kind: NotFound, message: "No such file or directory" }1931note: run with `RUST_BACKTRACE=1` environment variable to display a backtrace193219331934failures:1935 notifications::tests::sendmail_timeout_kills_and_reaps_the_child19361937test result: FAILED. 829 passed; 1 failed; 10 ignored; 0 measured; 0 filtered out; finished in 86.89s19381939error: test failed, to rerun pass `-p horae --bin horae`